program: Orca
programVersion: 5.0.4
elementType: N C C C C C N C C C C H H H H H H H H
charge: 2
multiplicity: 1
keywords: SP DSD-BLYP D3BJ def2-QZVPP def2-QZVPP/C def2/J TightSCF
formula: C9H8N2
InChI: InChI=1/C9H8N2/c1-2-6-10(5-1)9-11-7-3-4-8-11/h1-8H
19 atoms
N  -1.232686 -0.015191 -0.070458
C  -2.141228 0.906485 0.614743
C  -3.36594 0.545188 0.243744
C  -3.295854 -0.596881 -0.677925
C  -2.027497 -0.942675 -0.877904
C  -0.000389 -0.002192 0.006974
N  1.232046 0.010268 0.082684
C  2.131827 0.770857 -0.787021
C  3.360982 0.494292 -0.361558
C  3.302072 -0.435499 0.774593
C  2.036629 -0.734685 1.052707
H  -1.740403 1.672106 1.259876
H  -4.275269 1.027163 0.574386
H  -4.14555 -1.087867 -1.131208
H  -1.53352 -1.702236 -1.462856
H  1.723213 1.387002 -1.572199
H  4.266113 0.897073 -0.794004
H  4.157112 -0.823524 1.310158
H  1.550038 -1.35957 1.784721
totalener: -455.15591401 hartree
nucrepener: 531.72593499 hartree
electener: -986.88184900 hartree
oneelecener: -1641.41328164 hartree
twoeener: 654.53143264 hartree
kineticenergy: 453.95497855 hartree
exchangeener: -19.326077174386 hartree
correlationener: -1.357212477187 hartree
xcener: -20.683289651573 hartree
chargesum: 2.0000000
charge: 0.035498 0.008889 0.016624 0.017833 0.006862 0.393468 0.034680 0.008839 0.016366 0.018185 0.007149 0.167767 0.190109 0.190604 0.169275 0.168070 0.190723 0.190202 0.168855
charge: 0.491282 0.116306 0.181653 0.181812 0.116116 0.066695 0.491245 0.116271 0.181774 0.181766 0.116045 -0.044746 -0.015516 -0.015504 -0.044719 -0.044754 -0.015524 -0.015530 -0.044673
qa: 0.0355 0.0089 0.0166 0.0178 0.0069 0.3935 0.0347 0.0088 0.0164 0.0182 0.0071 0.1678 0.1901 0.1906 0.1693 0.1681 0.1907 0.1902 0.1689
va: 3.5185 3.6601 3.7932 3.7942 3.6603 3.7468 3.5198 3.6600 3.7930 3.7945 3.6602 0.9818 0.9690 0.9689 0.9814 0.9818 0.9688 0.9689 0.9816
total: -456.076964782 hartree
dispersion: -0.012898904 hartree
energy: -456.089863686494 hartree
dipole: 0.00162 -0.00164 -0.00002 0.00949 -0.00894 0.00056 -0.02913 0.02664 -0.00249
magnitude: 0.00255 au
magnitude: 0.00649 debye
