program: Orca
programVersion: 5.0.4
elementType: C F F C H H H H
charge: 0
multiplicity: 1
keywords: Freq RIJCOSX PBEh-3c
frequency: 0.00 0.00 0.00 0.00 0.00 0.00 253.45 399.32 478.01 582.87 904.72 1005.49 1190.33 1205.35 1216.31 1448.46 1451.09 1502.74 1540.82 1544.16 3133.72 3139.18 3225.80 3228.25
frequency: 253.45 399.32 478.01 582.87 904.72 1005.49 1190.33 1205.35 1216.31 1448.46 1451.09 1502.74 1540.82 1544.16 3133.72 3139.18 3225.80 3228.25
formula: C2H4F2
InChI: InChI=1/C2H4F2/c1-2(3)4/h2H,1H3
8 atoms
C  0.715649 -0.08279 -0.050597
F  1.235767 -0.196897 1.200639
F  1.25908 1.030895 -0.608374
C  -0.780712 0.030109 0.012854
H  1.054409 -0.942334 -0.634371
H  -1.083361 0.874578 0.631353
H  -1.207674 -0.878776 0.434588
H  -1.193058 0.165316 -0.985991
totalener: -277.77497803 hartree
nucrepener: 132.57611424 hartree
electener: -410.35109227 hartree
oneelecener: -646.90728672 hartree
twoeener: 236.55619446 hartree
kineticenergy: 276.11637199 hartree
exchangeener: -17.856199323085 hartree
correlationener: -1.531603125174 hartree
xcener: -19.387802448259 hartree
energy: -682.8787 -682.8760 -288.4927 -284.2422 -37.2951 -35.6126 -23.5178 -19.7748 -16.9544 -16.5955 -15.6365 -13.5892 -13.1393 -12.8538 -12.2992 -12.2442 -10.7197 4.2873 4.5804 4.6266 5.5235 6.1764 6.8119 7.3991 12.9800 14.1429 14.9110 15.2032 15.2777 16.2110 22.3591 24.9617 26.6302 26.8774 28.3578 29.5964 30.0677 31.9046 32.6593 33.2735 33.8133 34.2059 34.6257 35.1417 35.3935 36.2628 37.7831 39.9169 45.3388 47.2665 48.6325 50.6871 52.4472 54.9061 55.0797 59.1681 60.4247 62.0027 66.3917 67.7872 68.5115 73.2876 80.4529 82.9218 372.6741 382.9189 889.0089 895.9689 electronvolt
chargesum: -0.0000000
charge: 0.538788 -0.332989 -0.332861 -0.739331 0.150067 0.250007 0.232698 0.233622
charge: 0.240622 -0.193091 -0.192700 -0.388568 0.097112 0.149061 0.143616 0.143947
qa: 0.5388 -0.3330 -0.3329 -0.7393 0.1501 0.2500 0.2327 0.2336
va: 3.8452 1.0521 1.0523 3.7161 0.9143 0.9070 0.9069 0.9067
dispersion: -0.002055240 hartree
energy: -277.754720190092 hartree
dipole: -5.86129 5.22351 -0.63777 -1.92049 1.48390 -0.43659 -1.36340 1.05870 -0.30470
magnitude: 0.83079 au
magnitude: 2.11169 debye
temp: 298.15 k
press: 1.00 atm
zeropoint: 0.06253589 hartree
thermalvibcorrection: 0.00136611 hartree
thermalrotcorrection: 0.00141627 hartree
thermaltrasncorrection: 0.00141627 hartree
thermaltotal: -277.68798565 hartree
thermalcorr: 0.00419866 hartree
nonthermalcorr: 0.06253589 hartree
totalcorr: 0.06673454 hartree
thermalcorrenthalpy: 0.00094421 hartree
totalenthalpy: -277.68704144 hartree
vibrat: 0.00203717 hartree
rotat: 0.01144997 hartree
transl: 0.01828383 hartree
total: 0.03177097 hartree
totalentropycorr: -0.03177097 hartree
gibbsenthalpy: -277.71881241 hartree
gibbsminuselec: 0.03590778 hartree
