program: Orca
programVersion: 5.0.4
elementType: C F F C H H H H
charge: 0
multiplicity: 1
keywords: SP DSD-BLYP D3BJ def2-QZVPP def2-QZVPP/C def2/J TightSCF
formula: C2H4F2
InChI: InChI=1/C2H4F2/c1-2(3)4/h2H,1H3
8 atoms
C  0.046948 -0.301177 -0.205631
F  0.567066 -0.415284 1.045606
F  0.590379 0.812507 -0.763407
C  -1.449412 -0.188279 -0.142179
H  0.385708 -1.160722 -0.789404
H  -1.752062 0.656191 0.476319
H  -1.876375 -1.097163 0.279554
H  -1.861759 -0.053072 -1.141024
totalener: -277.75238765 hartree
nucrepener: 132.57611431 hartree
electener: -410.32850195 hartree
oneelecener: -646.92586637 hartree
twoeener: 236.59736442 hartree
kineticenergy: 277.16812217 hartree
exchangeener: -9.940830024763 hartree
correlationener: -0.648283384660 hartree
xcener: -10.589113409422 hartree
chargesum: -0.0000000
charge: 0.503090 -0.313543 -0.313184 -0.166980 0.051000 0.086026 0.075271 0.078319
charge: -0.665173 0.333761 0.334873 0.232223 -0.071214 -0.054503 -0.054971 -0.054996
qa: 0.5031 -0.3135 -0.3132 -0.1670 0.0510 0.0860 0.0753 0.0783
va: 3.9179 0.9551 0.9560 3.8578 0.9699 1.0097 0.9984 0.9983
total: -278.196707459 hartree
dispersion: -0.002050863 hartree
energy: -278.198758321675 hartree
dipole: -5.86129 5.13797 -0.72332 -1.92049 1.41450 -0.50599 -1.36340 1.00985 -0.35355
magnitude: 0.95090 au
magnitude: 2.41700 debye
