program: Orca
programVersion: 5.0.4
elementType: C C O H H H H
charge: 0
multiplicity: 1
keywords: Freq RIJCOSX PBEh-3c
frequency: 0.00 0.00 0.00 0.00 0.00 0.00 166.29 527.73 807.74 920.64 1172.34 1184.10 1439.09 1478.97 1514.41 1521.70 1931.95 2981.38 3113.79 3185.56 3241.70
frequency: 166.29 527.73 807.74 920.64 1172.34 1184.10 1439.09 1478.97 1514.41 1521.70 1931.95 2981.38 3113.79 3185.56 3241.70
formula: C2H4O
InChI: InChI=1/C2H4O/c1-2-3/h2H,1H3
7 atoms
C  0.842001 0.062629 0.143246
C  -0.628313 -0.071906 -0.114097
O  1.643689 -0.82348 0.04769
H  1.156054 1.082308 0.443319
H  -0.894757 -1.083475 -0.410862
H  -0.933092 0.630184 -0.89316
H  -1.185682 0.203839 0.783864
totalener: -153.50459283 hartree
nucrepener: 69.94688545 hartree
electener: -223.45147828 hartree
oneelecener: -346.49381514 hartree
twoeener: 123.04233686 hartree
kineticenergy: 152.44582370 hartree
exchangeener: -11.160595287784 hartree
correlationener: -1.034841295145 hartree
xcener: -12.195436582929 hartree
energy: -530.5702 -286.7602 -284.2847 -31.6963 -22.9979 -17.8472 -14.9094 -13.7632 -13.7264 -12.4297 -11.4430 -8.5469 0.3915 4.3646 4.9588 5.1687 5.4738 7.5971 8.8718 13.8738 14.5820 15.2087 15.2219 16.7601 20.1802 21.7828 25.8794 26.2822 26.5115 28.2474 28.6221 29.9720 32.0948 34.6968 39.4660 43.2081 47.3522 49.5628 50.5878 50.9029 55.0387 57.5383 58.0483 60.4296 64.7258 66.0048 71.6399 72.4943 80.1586 81.4143 369.8380 379.3555 696.6234 electronvolt
chargesum: -0.0000000
charge: 0.171224 -0.746339 -0.306140 0.144828 0.255160 0.240488 0.240779
charge: 0.056407 -0.410465 -0.174080 0.078558 0.149002 0.150137 0.150442
qa: 0.1712 -0.7463 -0.3061 0.1448 0.2552 0.2405 0.2408
va: 3.9258 3.6472 2.2266 0.9068 0.9067 0.9035 0.9034
dispersion: -0.001781650 hartree
energy: -153.495855642289 hartree
dipole: -4.02671 3.17772 -0.84899 1.83366 -1.15817 0.67549 -0.15995 0.19758 0.03762
magnitude: 1.08558 au
magnitude: 2.75932 debye
temp: 298.15 k
press: 1.00 atm
zeropoint: 0.05738109 hartree
thermalvibcorrection: 0.00100425 hartree
thermalrotcorrection: 0.00141627 hartree
thermaltrasncorrection: 0.00141627 hartree
thermaltotal: -153.43463775 hartree
thermalcorr: 0.00383680 hartree
nonthermalcorr: 0.05738109 hartree
totalcorr: 0.06121789 hartree
thermalcorrenthalpy: 0.00094421 hartree
totalenthalpy: -153.43369355 hartree
vibrat: 0.00167616 hartree
rotat: 0.01027024 hartree
transl: 0.01771022 hartree
total: 0.02965661 hartree
totalentropycorr: -0.02965661 hartree
gibbsenthalpy: -153.46335016 hartree
gibbsminuselec: 0.03250549 hartree
