program: Orca
programVersion: 5.0.4
elementType: C C H H H H
charge: 2
multiplicity: 1
keywords: SP DSD-BLYP D3BJ def2-QZVPP def2-QZVPP/C def2/J TightSCF
formula: C2H4
InChI: InChI=1/C2H4/c1-2/h1H,2H3
6 atoms
C  0.698918 -0.008765 0.01394
C  -0.595308 0.006436 -0.010186
H  1.815613 -0.01732 0.029362
H  -1.052514 0.003795 1.052009
H  -0.980781 0.954255 -0.553231
H  -1.016936 -0.912978 -0.572869
totalener: -77.29946444 hartree
nucrepener: 33.17945879 hartree
electener: -110.47892323 hartree
oneelecener: -159.53153246 hartree
twoeener: 49.05260922 hartree
kineticenergy: 77.09084026 hartree
exchangeener: -3.432825175874 hartree
correlationener: -0.235768410568 hartree
xcener: -3.668593586442 hartree
energy: -317.1295 -311.0147 -43.6211 -36.1273 -32.0349 -29.9446 -29.9260 -16.9529 -16.9291 -9.6137 -8.9235 -7.8128 -7.7764 -6.7336 -6.2550 -6.2296 -5.2712 -4.4839 -4.4796 -1.8429 -1.2936 -1.2904 -0.3185 -0.2470 -0.2313 -0.0274 2.3548 2.5572 2.6138 3.4418 6.9092 6.9623 7.2121 7.2774 7.3530 8.0398 9.5456 9.5560 10.7321 11.7207 11.7910 12.6974 15.4419 15.6578 15.7622 15.8860 16.0088 16.7909 17.9162 17.9255 18.6832 21.6862 23.3959 23.4554 23.8452 26.6014 26.6165 29.8982 31.6629 33.7687 33.8027 36.4669 36.6352 36.7108 38.0597 38.4015 38.4271 39.8484 41.2783 41.3014 43.5138 43.5222 43.6265 44.7571 44.8195 46.6748 47.6066 48.0979 48.1054 49.3360 50.1462 50.1689 53.9932 55.1337 55.2022 56.8570 56.9140 57.0540 58.6131 59.3506 59.4035 61.7351 61.7463 64.1545 64.1752 64.6028 65.6004 69.1171 69.2017 69.2854 71.1101 71.2858 73.0495 73.0664 73.7592 76.6060 76.6636 80.8098 81.1645 81.3424 84.6881 84.7801 86.6865 90.9248 91.5247 91.6029 99.7556 99.9114 103.9636 104.0591 107.3767 117.3582 117.3722 120.6154 124.1312 124.7285 124.8269 124.9069 132.7732 132.8199 136.2466 136.7224 136.9406 138.5299 139.0225 139.0957 144.1218 144.1414 145.8800 146.1452 146.7982 146.8587 148.3545 148.4185 148.8909 149.9439 150.2057 150.4352 150.5614 152.3226 153.3428 153.4146 153.4924 154.2932 157.8969 159.7023 159.7551 159.8741 163.7351 163.8856 164.9498 168.9585 170.1331 170.2792 173.6670 173.7030 173.9055 179.3510 180.2482 180.8482 182.5573 185.6027 185.6115 186.5845 189.5859 189.6328 193.3793 194.4872 194.8375 195.4622 196.4417 196.6301 197.9335 198.0130 199.1579 203.0178 203.1896 203.3450 203.8486 204.0550 208.1186 208.8412 208.9606 211.1297 211.1459 214.4803 214.6359 214.8611 216.8895 217.0400 218.8636 220.5490 221.6158 221.8219 224.9747 226.8891 226.9864 229.3368 229.7922 235.8669 236.2408 243.3179 243.8566 246.4753 246.5440 249.6828 249.8827 252.0718 253.9342 259.4699 259.7776 262.6555 265.9308 281.2237 281.3823 283.4796 313.6249 313.7829 327.5770 338.0569 779.0665 804.2782 4039.3005 4068.6897 electronvolt
chargesum: 2.0000000
charge: 0.652999 -0.084284 0.382385 0.350739 0.349254 0.348907
charge: 1.028699 0.428841 0.070958 0.156202 0.158118 0.157182
qa: 0.6530 -0.0843 0.3824 0.3507 0.3493 0.3489
va: 2.9131 3.8063 0.8493 0.8913 0.8927 0.8928
total: -77.452983493 hartree
dispersion: -0.001291761 hartree
energy: -77.454275254249 hartree
dipole: -1.15828 1.53353 0.37525 0.02604 -0.02395 0.00209 -0.04196 0.03816 -0.00380
magnitude: 0.37527 au
magnitude: 0.95387 debye
