program: Gaussian 09
title: 000076543
version: EM64L-G09RevD.01
frameworkgroup: C1[X(C8H11NO)]
method: RPBEPBE
basis: SDD
operation: Freq
keyword: #p
keyword: freq=noraman
keyword: PBEPBE/SDD
title: #p freq=noraman PBEPBE/SDD
converged: NO YES NO YES
title: Mulliken charges:
elementType: O N C C C C C C C C H H H H H H H H H H H
charge: -0.449050 -0.707806 0.126515 0.401579 0.388298 -0.605232 -0.573688 0.303487 -0.850224 -0.848985 0.216246 0.248292 0.224249 0.233874 0.224490 0.240237 0.222740 0.222877 0.317583 0.318880 0.345640
chargesum: 0.00000
title: Mulliken charges with hydrogens summed into heavy atoms:
elementType: O N C C C C C C C C
charge: -0.103411 -0.071344 0.126515 0.401579 0.388298 -0.388986 -0.325396 0.303487 -0.167612 -0.163130
polarizability: 1.26049585e+02 -1.78117393e+00 1.14813657e+02 -6.87942897e-04 1.09075847e-02 5.08798383e+01
1716.lowfreq: -16.0126 -9.4585 -0.0002 0.0006 0.0007 7.3911 114.4605 168.5010 171.1550
frequency: 114.4336 168.4883 171.1547 189.4421 213.4349 227.6266 284.6434 285.8775 289.3673 329.8700 334.3338 361.6757 451.7506 497.4398 497.7578 557.2117 561.5742 580.5474 725.6984 762.4809 828.7715 868.3475 909.9483 953.2292 1000.9265 1008.9745 1038.4381 1041.0813 1117.4979 1134.5350 1175.5385 1258.5228 1266.4240 1343.5155 1385.5409 1393.3263 1404.2703 1452.8563 1459.9202 1470.5327 1472.3260 1492.5375 1506.0752 1608.9726 1627.3862 1646.4109 2945.9191 2947.2107 3011.8622 3012.6225 3081.1929 3086.4404 3100.3894 3151.6010 3583.7575 3585.5726 3722.3011
redmass: 2.4677 1.0397 1.7135 1.7341 2.3088 1.3164 2.5449 1.1108 3.4793 3.1811 1.1054 5.4840 6.8698 3.7198 3.1963 3.2613 4.8569 3.1574 3.8814 3.9524 1.4072 1.4325 2.5971 3.3459 1.3586 1.8419 1.5063 1.5048 1.8387 1.5917 1.3907 1.4974 2.7572 5.6432 1.8531 1.2893 2.2369 2.0015 1.4514 1.0457 1.0454 1.4290 2.0673 6.5681 1.7089 2.3630 1.0395 1.0397 1.0975 1.0974 1.0951 1.0949 1.0910 1.0921 1.0473 1.0633 1.1035
irintensity: 4.1373 0.0809 0.3110 0.0364 15.0750 246.2631 0.3401 160.0325 6.0460 3.8638 0.9240 2.7373 0.4713 5.4873 1.0259 3.4888 9.4345 5.9362 8.0867 15.7070 21.3567 21.7276 4.9791 8.3101 16.7877 75.0894 8.3042 4.2754 15.8053 106.4842 47.4181 5.3210 68.4149 0.0921 5.2242 10.8827 36.8993 53.3469 3.5470 20.5053 6.9349 28.6450 161.8339 12.6896 104.7086 43.1030 58.5063 38.2672 26.0365 33.3029 16.0940 16.9789 24.6133 7.6828 62.1541 6.5075 22.5797
temp: 298.150 k
press: 1.00000 atm
elementType: 8 7 6 6 6 6 6 6 6 6 1 1 1 1 1 1 1 1 1 1 1
symmnumber: 1
zpe: 452784.1 jmol-1
zpe.correction: 0.172456 hartree
zpe.thermalcorrener: 0.183246 hartree
zpe.thermalcorrenthalpy: 0.184190 hartree
zpe.thermalcorrgfe: 0.137529 hartree
zpe.sumelectzpe: -440.681280 hartree
zpe.sumelectthermal: -440.670490 hartree
zpe.sumelectthermalent: -440.669546 hartree
zpe.sumelectthermalfe: -440.716207 hartree
dipole: 2.6179 1.5777 -0.0071
dipole: 3.0566
quadrupole: -51.7083 -51.9621 -64.9140
quadrupole: -6.4335 -0.0227 0.0018
quadrupole: 4.4865 4.2327 -8.7192 -6.4335 -0.0227 0.0018
hfenergy: -440.853736 hartree
pointgroup: C01 [X(C8H11N1O1)]
dipole: -1.0431786 0.5982448 0.0027739 debye
dipolederiv: -1.5125693 -0.0262981 -0.0000008 -0.0109926 -0.0593292 0.0000849 0.0001637 0.0000651 -0.4285859 -1.3829332 -0.0254998 -0.0009519 -0.0089756 -0.1649392 -0.0001589 -0.0033468 -0.0001962 -0.7169646 1.2743178 0.0213123 0.0004736 0.0364125 -0.3743375 0.0000768 0.0004142 0.0001197 0.0375805 -0.0879246 0.1783293 -0.0000826 -0.3471968 0.2600233 -0.0001263 0.0002552 -0.0002973 -0.0464627 -0.0498988 -0.1577105 -0.0000328 0.3257762 0.2883215 -0.0000118 0.000061 -0.000008 -0.0659285 -0.1830565 -0.2025219 0.0000833 0.2209952 -0.0006881 -0.0000358 -0.0000193 -0.0000407 -0.241588 -0.1560241 0.1790803 0.0000107 -0.2196766 0.0238079 -0.0000463 -0.000002 0.0000048 -0.197748 1.3051573 0.0568722 -0.0000391 0.0704461 -0.1159139 -0.0000171 -0.0000876 -0.0000009 0.0494279 0.0088652 0.0546597 -0.0001487 0.0691154 -0.0080146 0.0000254 -0.0002987 0.0002077 0.1005253 0.0073109 -0.0586544 -0.0000999 -0.0695082 -0.0249241 -0.0000129 -0.0001781 -0.0000247 0.104026 -0.0037302 -0.0978707 0.000029 -0.1113184 -0.0782614 0.0000442 0.0000169 0.0000379 0.1689791 0.0605102 0.0668148 -0.0000055 0.0876714 -0.0479556 0.000028 -0.0000113 0.0000182 0.1652323 -0.0223703 0.0961711 0.1238643 0.023815 0.0308749 0.016933 0.1228703 -0.0571999 -0.0577113 0.0005555 -0.1730479 -0.0000964 -0.0566496 -0.0641013 -0.000072 -0.0000344 -0.0001019 0.1088918 -0.0217846 0.0961044 -0.1236188 0.0240067 0.0308229 -0.0167752 -0.1226728 0.0572947 -0.0578592 0.0035018 0.1697464 0.0000418 0.0555969 -0.0557147 -0.0000338 0.000045 -0.0000595 0.1098722 -0.0202249 -0.0954597 0.1244481 -0.023639 0.0321869 -0.0163214 0.122827 0.0561986 -0.0584119 -0.0201407 -0.0953973 -0.1243179 -0.0236403 0.0322947 0.016354 -0.122707 -0.0561201 -0.0581523 0.2062705 0.0202007 0.000215 0.0088597 0.1295922 -0.0002455 0.0014094 -0.0005602 0.3537635 0.2072528 -0.0189592 0.0002168 -0.0066585 0.1351956 0.0003605 0.0013657 0.0007104 0.3537663 0.3869152 0.0121282 0.0000121 -0.0444397 0.0310598 -0.00005 -0.0000704 -0.0000478 0.3773475 unknown
polarizability: 125.9671634|2.0228365|114.8960782|-0.0004515|-0.0109199|50.8798383 unknown
InChI: InChI=1S/C8H11NO/c1-5-3-7(10)4-6(2)8(5)9/h3-4,10H,9H2,1-2H3
charge 0 multiplicity 1
21 atoms
O  3.130316 -0.054227 -0.000038
N  -2.523355 -0.003206 -0.000286
C  -1.118271 0.005137 0.000125
C  -0.410035 1.246024 -0.000152
C  -0.396021 -1.230652 0.000226
C  1.004097 1.234142 -0.000193
C  1.014731 -1.20836 0.000207
C  1.71613 0.014747 0.000026
C  -1.173223 2.557801 -0.00051
C  -1.147072 -2.549676 0.0003
H  1.545665 2.190747 -0.000388
H  1.584316 -2.143489 0.0003
H  -1.824183 2.656573 0.892695
H  -0.48417 3.418972 0.000077
H  -1.823007 2.656689 -0.894536
H  -0.448167 -3.40228 0.000042
H  -1.796051 -2.654709 0.894283
H  -1.796526 -2.654451 -0.893339
H  -3.04899 0.863931 0.001551
H  -3.036584 -0.877765 0.00198
H  3.517003 0.855854 0.00013
