program: Orca
programVersion: 5.0.4
elementType: N C N C C C C C O H H H H H H H H
charge: 0
multiplicity: 1
keywords: Freq RIJCOSX PBEh-3c
frequency: 0.00 0.00 0.00 0.00 0.00 0.00 79.82 105.17 186.17 254.88 401.33 445.01 468.89 524.77 536.60 575.12 622.88 656.31 761.92 776.27 779.92 812.25 933.69 1006.62 1014.31 1023.52 1029.55 1047.66 1142.91 1198.90 1203.26 1258.25 1276.71 1394.30 1407.00 1452.83 1485.62 1502.42 1545.10 1703.02 1773.00 1836.75 1898.42 3061.23 3098.18 3275.90 3280.10 3303.22 3329.38 3673.79 3785.49
frequency: 79.82 105.17 186.17 254.88 401.33 445.01 468.89 524.77 536.60 575.12 622.88 656.31 761.92 776.27 779.92 812.25 933.69 1006.62 1014.31 1023.52 1029.55 1047.66 1142.91 1198.90 1203.26 1258.25 1276.71 1394.30 1407.00 1452.83 1485.62 1502.42 1545.10 1703.02 1773.00 1836.75 1898.42 3061.23 3098.18 3275.90 3280.10 3303.22 3329.38 3673.79 3785.49
formula: C6H8N2O
InChI: InChI=1/C6H8N2O/c7-6(9)8-4-2-1-3-5-8/h2-5H,1,7H2
17 atoms
N  2.763544 0.576002 -0.142493
C  1.9483 -0.503026 -0.370999
N  0.605208 -0.288314 -0.085202
C  -0.336496 -1.233618 -0.503848
C  -1.644219 -1.034097 -0.385486
C  -2.237975 0.219584 0.183954
C  -1.16186 1.045633 0.819587
C  0.133391 0.79032 0.664312
O  2.361201 -1.566578 -0.769676
H  2.415592 1.506076 -0.299458
H  3.71387 0.433219 -0.439182
H  0.07997 -2.135942 -0.923195
H  -2.309206 -1.819285 -0.718372
H  -2.761655 0.790425 -0.593904
H  -3.009024 -0.023354 0.923132
H  -1.44314 1.870345 1.460353
H  0.882399 1.372709 1.180578
totalener: -417.29111761 hartree
nucrepener: 437.41999019 hartree
electener: -854.71110780 hartree
oneelecener: -1433.19222568 hartree
twoeener: 578.48111789 hartree
kineticenergy: 414.23633948 hartree
exchangeener: -30.973652470021 hartree
correlationener: -2.907568702503 hartree
xcener: -33.881221172524 hartree
energy: -529.5354 -399.7069 -398.9003 -287.9173 -285.3472 -285.0250 -284.3418 -284.2815 -284.0602 -31.9138 -29.1654 -27.4833 -24.5635 -23.4015 -21.0416 -19.2375 -18.6697 -17.3650 -15.8058 -15.4896 -14.6995 -14.1256 -13.8205 -13.5871 -13.2788 -13.0383 -11.6299 -11.1899 -10.7674 -9.3504 -8.8341 -8.6200 -6.5417 0.7960 1.3536 3.3335 3.6442 4.3291 4.6104 5.1432 5.4737 5.9443 6.1632 6.1857 6.7664 7.4318 8.3204 8.8316 9.1225 9.8543 10.9176 12.1953 12.9342 13.4833 14.3484 14.7580 15.1337 15.5357 15.5903 16.3499 16.5349 17.5330 17.8282 18.0292 18.5660 19.1876 19.2836 20.3647 20.7720 22.3595 22.5386 24.3200 25.0849 25.3351 25.4358 26.2862 26.4843 26.8495 27.1742 27.3736 27.9497 28.3081 28.7588 28.8852 29.7967 31.0622 31.3972 31.6054 33.4498 34.4337 35.2443 36.0923 37.0030 38.5566 38.9958 39.4596 40.3742 41.4641 42.9619 43.1728 44.5661 46.2624 47.5111 48.6689 49.6761 49.8091 50.2661 52.0529 52.4035 53.5216 54.5124 55.3418 55.8609 56.9506 57.3487 58.7595 59.3079 59.9806 60.2795 61.1268 62.2924 63.3590 64.3691 64.7079 65.7630 67.0125 67.4731 68.8832 70.5592 71.7251 72.3296 72.7344 73.0313 74.2489 75.2075 76.9937 77.2547 80.1739 81.9455 84.4232 90.1863 93.6721 365.0325 369.1541 378.9013 380.4182 386.3324 387.4470 522.8931 528.8578 701.0603 electronvolt
chargesum: -0.0000000
charge: -0.835300 0.677281 -0.578839 0.044335 -0.330903 -0.432055 -0.313410 0.019577 -0.432518 0.362330 0.377004 0.282734 0.224601 0.232219 0.227763 0.223846 0.251333
charge: -0.395731 0.131202 -0.094903 -0.057217 -0.184865 -0.231253 -0.176356 -0.080775 -0.269184 0.253338 0.262815 0.159123 0.139457 0.131973 0.132580 0.138908 0.140887
qa: -0.8353 0.6773 -0.5788 0.0443 -0.3309 -0.4321 -0.3134 0.0196 -0.4325 0.3623 0.3770 0.2827 0.2246 0.2322 0.2278 0.2238 0.2513
va: 2.8576 4.1196 3.1874 3.6879 3.7948 3.7119 3.8190 3.7030 2.1961 0.8464 0.8424 0.8922 0.9217 0.8890 0.8948 0.9214 0.8995
dispersion: -0.009459863 hartree
energy: -417.268449108746 hartree
dipole: -4.82935 4.60352 -0.22583 3.52455 -2.17774 1.34681 1.14834 -1.03954 0.10880
magnitude: 1.36994 au
magnitude: 3.48211 debye
temp: 298.15 k
press: 1.00 atm
zeropoint: 0.14336160 hartree
thermalvibcorrection: 0.00491510 hartree
thermalrotcorrection: 0.00141627 hartree
thermaltrasncorrection: 0.00141627 hartree
thermaltotal: -417.11733987 hartree
thermalcorr: 0.00774765 hartree
nonthermalcorr: 0.14336160 hartree
totalcorr: 0.15110924 hartree
thermalcorrenthalpy: 0.00094421 hartree
totalenthalpy: -417.11639566 hartree
vibrat: 0.00811461 hartree
rotat: 0.01361916 hartree
transl: 0.01917753 hartree
total: 0.04091130 hartree
totalentropycorr: -0.04091130 hartree
gibbsenthalpy: -417.15730696 hartree
gibbsminuselec: 0.11114215 hartree
