program: Orca
programVersion: 5.0.4
elementType: N C N C C C C C O H H H H H H H H
charge: 0
multiplicity: 1
keywords: Opt RIJCOSX PBEh-3c
formula: C6H8N2O
InChI: InChI=1/C6H8N2O/c7-6(9)8-4-2-1-3-5-8/h2-5H,1,7H2
17 atoms
N  2.763544 0.576002 -0.142493
C  1.9483 -0.503026 -0.370999
N  0.605208 -0.288314 -0.085202
C  -0.336496 -1.233618 -0.503848
C  -1.644219 -1.034097 -0.385486
C  -2.237975 0.219584 0.183954
C  -1.16186 1.045633 0.819587
C  0.133391 0.79032 0.664312
O  2.361201 -1.566578 -0.769676
H  2.415592 1.506076 -0.299458
H  3.71387 0.433219 -0.439182
H  0.07997 -2.135942 -0.923195
H  -2.309206 -1.819285 -0.718372
H  -2.761655 0.790425 -0.593904
H  -3.009024 -0.023354 0.923132
H  -1.44314 1.870345 1.460353
H  0.882399 1.372709 1.180578
totalener: -417.29111366 hartree
nucrepener: 437.43572708 hartree
electener: -854.72684074 hartree
oneelecener: -1433.22422337 hartree
twoeener: 578.49738262 hartree
kineticenergy: 414.23711095 hartree
exchangeener: -30.973758283991 hartree
correlationener: -2.907587193898 hartree
xcener: -33.881345477889 hartree
dispersion: -0.009460223 hartree
energy: -529.5371 -399.7062 -398.8980 -287.9183 -285.3486 -285.0269 -284.3400 -284.2804 -284.0587 -31.9144 -29.1658 -27.4829 -24.5630 -23.4016 -21.0414 -19.2374 -18.6697 -17.3649 -15.8055 -15.4896 -14.6994 -14.1257 -13.8203 -13.5874 -13.2790 -13.0380 -11.6295 -11.1900 -10.7670 -9.3507 -8.8344 -8.6201 -6.5415 0.7961 1.3534 3.3335 3.6441 4.3294 4.6105 5.1433 5.4737 5.9445 6.1636 6.1860 6.7667 7.4316 8.3203 8.8316 9.1225 9.8541 10.9176 12.1953 12.9341 13.4831 14.3481 14.7579 15.1337 15.5356 15.5904 16.3499 16.5352 17.5333 17.8282 18.0292 18.5661 19.1879 19.2835 20.3646 20.7723 22.3594 22.5388 24.3201 25.0848 25.3354 25.4356 26.2865 26.4842 26.8500 27.1741 27.3738 27.9500 28.3083 28.7589 28.8856 29.7967 31.0621 31.3971 31.6049 33.4499 34.4337 35.2442 36.0923 37.0030 38.5564 38.9960 39.4594 40.3740 41.4641 42.9622 43.1728 44.5665 46.2624 47.5111 48.6691 49.6764 49.8093 50.2659 52.0530 52.4033 53.5213 54.5124 55.3419 55.8607 56.9505 57.3486 58.7599 59.3080 59.9807 60.2793 61.1267 62.2924 63.3592 64.3689 64.7079 65.7635 67.0126 67.4735 68.8832 70.5591 71.7255 72.3296 72.7345 73.0311 74.2488 75.2072 76.9936 77.2546 80.1739 81.9451 84.4230 90.1859 93.6720 365.0327 369.1540 378.9020 380.4174 386.3323 387.4475 522.8949 528.8584 701.0587 electronvolt
chargesum: -0.0000000
charge: -0.835404 0.677324 -0.578900 0.044482 -0.331021 -0.432123 -0.313499 0.019699 -0.432481 0.362353 0.377027 0.282729 0.224617 0.232236 0.227780 0.223860 0.251322
charge: -0.395810 0.131243 -0.094945 -0.057109 -0.184951 -0.231298 -0.176418 -0.080691 -0.269157 0.253353 0.262832 0.159119 0.139466 0.131980 0.132588 0.138916 0.140881
qa: -0.8354 0.6773 -0.5789 0.0445 -0.3310 -0.4321 -0.3135 0.0197 -0.4325 0.3624 0.3770 0.2827 0.2246 0.2322 0.2278 0.2239 0.2513
va: 2.8575 4.1196 3.1874 3.6879 3.7947 3.7119 3.8189 3.7030 2.1961 0.8464 0.8424 0.8922 0.9217 0.8890 0.8948 0.9214 0.8995
dispersion: -0.009459863 hartree
energy: -417.268449132138 hartree
dipole: -4.82935 4.60393 -0.22542 3.52455 -2.17797 1.34659 1.14834 -1.03963 0.10872
magnitude: 1.36965 au
magnitude: 3.48137 debye
