program: Orca
programVersion: 5.0.4
elementType: N C N C C C C C H H H H H H H H
charge: 2
multiplicity: 1
keywords: Freq RIJCOSX PBEh-3c
frequency: 0.00 0.00 0.00 0.00 0.00 0.00 94.99 154.50 171.83 339.99 375.62 476.32 478.17 563.77 632.34 745.40 784.21 806.14 822.56 877.51 929.24 956.56 983.48 997.04 1031.68 1061.56 1147.21 1174.44 1223.88 1253.24 1283.86 1306.87 1357.09 1404.95 1492.43 1493.12 1640.57 1676.39 1744.10 2055.96 3020.34 3039.45 3279.98 3280.71 3307.15 3308.56 3395.62 3504.74
frequency: 94.99 154.50 171.83 339.99 375.62 476.32 478.17 563.77 632.34 745.40 784.21 806.14 822.56 877.51 929.24 956.56 983.48 997.04 1031.68 1061.56 1147.21 1174.44 1223.88 1253.24 1283.86 1306.87 1357.09 1404.95 1492.43 1493.12 1640.57 1676.39 1744.10 2055.96 3020.34 3039.45 3279.98 3280.71 3307.15 3308.56 3395.62 3504.74
formula: C6H8N2
InChI: InChI=1/C6H8N2/c7-6-8-4-2-1-3-5-8/h2-5H,1,7H2
16 atoms
N  3.070475 -0.209719 0.37303
C  1.971422 0.080075 -0.140705
N  0.689301 0.013275 -0.023089
C  0.00023 -1.05285 -0.635957
C  -1.342775 -1.046151 -0.646916
C  -2.141549 0.03001 -0.054494
C  -1.343596 1.092878 0.562541
C  -0.000585 1.087677 0.57443
H  3.170402 -0.714516 1.265589
H  3.947549 0.053267 -0.090677
H  0.610948 -1.82434 -1.083898
H  -1.844642 -1.88826 -1.109991
H  -2.835798 0.452933 -0.801974
H  -2.844256 -0.390294 0.687203
H  -1.846152 1.924105 1.044165
H  0.609527 1.870108 1.003832
totalener: -341.40224735 hartree
nucrepener: 348.41115482 hartree
electener: -689.81340217 hartree
oneelecener: -1128.10654942 hartree
twoeener: 438.29314724 hartree
kineticenergy: 338.90290733 hartree
exchangeener: -25.977266980203 hartree
correlationener: -2.436506136842 hartree
xcener: -28.413773117045 hartree
energy: -413.2153 -411.8102 -298.7944 -295.6246 -295.6236 -294.9923 -294.9922 -293.9449 -42.4062 -40.2785 -35.5079 -34.1351 -32.1947 -30.1791 -30.0023 -28.7031 -28.0342 -25.6748 -25.5029 -24.6629 -23.8531 -23.8493 -22.9841 -22.5965 -21.6091 -21.1108 -18.7218 -17.9146 -12.8581 -11.2465 -9.3017 -7.4676 -6.4899 -5.4536 -4.8494 -4.4269 -4.0466 -3.4522 -2.5809 -2.5198 -2.4680 -1.9938 -1.7063 -0.5842 -0.3790 0.7326 2.4152 2.5109 3.3371 4.4051 4.4848 5.1966 5.5556 5.9438 6.1671 6.6282 7.0201 7.3073 7.9642 8.0654 9.0898 9.9325 10.5902 10.7002 11.6674 12.7154 14.4147 15.0956 15.7302 15.8351 16.2777 17.0502 17.2232 17.2496 17.5846 17.6665 18.5307 19.2533 20.3943 21.1889 22.1377 23.4554 23.8857 23.9559 26.4433 26.7514 28.7666 29.1424 30.1395 31.1540 31.3273 32.0230 33.3347 34.3668 34.5586 39.0208 39.5925 39.6511 41.9573 42.1219 42.6798 44.7470 45.5521 46.3668 47.9337 48.9917 49.2801 49.7567 49.9183 51.2524 51.3255 54.7545 55.2351 56.4821 56.8195 57.1632 60.2162 61.5386 61.6816 62.9424 63.0645 63.9895 66.6692 67.4283 69.5293 73.9580 75.9755 82.7845 354.2896 358.5148 367.0731 368.8780 374.6929 377.8101 511.5240 516.1823 electronvolt
chargesum: 2.0000000
charge: -0.585947 0.576868 -0.396774 0.020213 -0.189828 -0.527321 -0.189822 0.020241 0.488555 0.505122 0.372573 0.376559 0.391915 0.388518 0.376564 0.372564
charge: -0.092322 0.233215 0.141766 -0.052451 0.024980 -0.236664 0.024968 -0.052423 0.338229 0.352787 0.200261 0.216090 0.242575 0.242628 0.216093 0.200269
qa: -0.5859 0.5769 -0.3968 0.0202 -0.1898 -0.5273 -0.1898 0.0202 0.4886 0.5051 0.3726 0.3766 0.3919 0.3885 0.3766 0.3726
va: 3.2792 3.5819 3.5395 3.4598 3.6543 3.5495 3.6543 3.4597 0.7426 0.7263 0.8313 0.8434 0.8132 0.8148 0.8434 0.8313
dispersion: -0.008361201 hartree
energy: -341.387029275730 hartree
dipole: -2.15092 3.84796 1.69704 -0.41863 0.13050 -0.28813 0.73967 -0.22870 0.51098
magnitude: 1.79557 au
magnitude: 4.56398 debye
temp: 298.15 k
press: 1.00 atm
zeropoint: 0.13594636 hartree
thermalvibcorrection: 0.00424039 hartree
thermalrotcorrection: 0.00141627 hartree
thermaltrasncorrection: 0.00141627 hartree
thermaltotal: -341.24400999 hartree
thermalcorr: 0.00707293 hartree
nonthermalcorr: 0.13594636 hartree
totalcorr: 0.14301929 hartree
thermalcorrenthalpy: 0.00094421 hartree
totalenthalpy: -341.24306578 hartree
vibrat: 0.00699852 hartree
rotat: 0.01327087 hartree
transl: 0.01898213 hartree
total: 0.03925151 hartree
totalentropycorr: -0.03925151 hartree
gibbsenthalpy: -341.28231729 hartree
gibbsminuselec: 0.10471198 hartree
