program: Orca
programVersion: 5.0.4
elementType: F N C F N C C C C C F H H H H H H
charge: 1
multiplicity: 1
keywords: Opt RIJCOSX PBEh-3c
formula: C6H6F3N2
InChI: InChI=1/C6H6F3N2/c7-6(11(8)9)10-4-2-1-3-5-10/h2-5H,1H2
17 atoms
F  3.720485 0.271748 0.558571
N  2.766609 0.434397 -0.396278
C  1.796495 -0.561056 -0.117212
F  2.183023 -1.778253 0.057839
N  0.549469 -0.252956 -0.046544
C  -0.421005 -1.263314 0.221572
C  -1.715394 -0.970176 0.245444
C  -2.26507 0.382199 0.007994
C  -1.194016 1.379198 -0.213321
C  0.099578 1.091646 -0.238235
F  3.360917 0.016775 -1.550989
H  -0.040622 -2.255327 0.399265
H  -2.40003 -1.781808 0.453058
H  -2.946982 0.364032 -0.851036
H  -2.896712 0.6855 0.850865
H  -1.469561 2.4139 -0.367862
H  0.872615 1.823494 -0.40173
totalener: -639.52113863 hartree
nucrepener: 641.46291833 hartree
electener: -1280.98405697 hartree
oneelecener: -2135.82522093 hartree
twoeener: 854.84116396 hartree
kineticenergy: 635.45803249 hartree
exchangeener: -42.658010414024 hartree
correlationener: -3.703742045146 hartree
xcener: -46.361752459170 hartree
dispersion: -0.009340326 hartree
dispersion: -0.009339484 hartree
dispersion: -0.009337550 hartree
dispersion: -0.009335169 hartree
dispersion: -0.009334187 hartree
dispersion: -0.009333092 hartree
dispersion: -0.009332610 hartree
dispersion: -0.009331107 hartree
dispersion: -0.009330899 hartree
dispersion: -0.009331798 hartree
dispersion: -0.009332184 hartree
dispersion: -0.009331938 hartree
energy: -690.4801 -689.1374 -689.1132 -408.9510 -407.7194 -295.3874 -290.8542 -290.7883 -290.1600 -290.0421 -289.5156 -44.7484 -43.8696 -41.4150 -37.0229 -32.0932 -30.5453 -29.2704 -27.4720 -25.5256 -25.2041 -24.1460 -23.4571 -23.1664 -21.8144 -21.4914 -21.1049 -20.5778 -20.2684 -19.4712 -19.3220 -19.1097 -18.8906 -18.4811 -18.2322 -18.0767 -17.1605 -16.4418 -14.9609 -14.2870 -13.1721 -7.1414 -4.6609 -2.9283 -2.6072 -1.1786 -0.7608 -0.5551 -0.1204 -0.0333 0.8899 1.2184 1.5173 1.5805 1.6801 3.3824 3.6199 4.4007 5.1462 6.5769 7.0590 7.5225 8.4723 9.2351 9.5597 9.6064 9.7973 10.0266 10.7973 11.3159 11.8274 12.0833 12.4130 13.1642 14.1172 14.4922 15.1711 15.6965 16.1988 17.7404 19.0949 19.6571 19.8028 20.3194 21.1544 21.5534 21.7605 21.9576 22.5822 22.9407 23.3936 23.8075 25.1857 25.3302 25.5257 25.7201 26.6412 27.2801 27.4519 27.5444 28.0356 28.4395 28.4805 28.7918 29.2500 29.6261 29.8180 30.1010 30.5278 31.7343 32.2672 32.4805 33.6055 33.8282 34.5972 35.5102 35.5974 35.7099 36.7965 37.3926 38.4015 39.0539 40.4830 41.0914 43.2163 44.0296 44.7129 45.8530 46.4627 47.0212 48.4695 49.5451 49.8634 50.2516 50.8148 51.1078 52.2097 53.2074 53.7884 54.7223 54.8705 55.0288 56.2810 56.5637 57.6824 59.0618 60.3861 61.0094 61.7620 63.5193 63.8311 65.2281 65.4643 66.3050 66.4576 68.2415 68.5621 69.8581 71.2044 74.6913 75.1940 77.0546 77.3126 83.1905 85.5321 87.1858 359.1219 363.3739 373.5883 377.6434 380.4147 382.7274 518.1307 522.5985 884.5426 888.6289 896.1740 electronvolt
chargesum: 1.0000000
charge: -0.229954 0.321462 0.859749 -0.198278 -0.488393 0.002208 -0.247186 -0.486987 -0.243924 0.000296 -0.232705 0.333112 0.315043 0.319404 0.317985 0.314089 0.344079
charge: -0.109632 0.294888 0.253521 -0.022348 0.091160 -0.083056 -0.049115 -0.235194 -0.061488 -0.081325 -0.114719 0.181349 0.184492 0.192366 0.190943 0.184426 0.183732
qa: -0.2300 0.3215 0.8597 -0.1983 -0.4884 0.0022 -0.2472 -0.4870 -0.2439 0.0003 -0.2327 0.3331 0.3150 0.3194 0.3180 0.3141 0.3441
va: 1.0906 2.9049 3.8134 1.2604 3.4549 3.5488 3.7402 3.6238 3.7361 3.5238 1.0855 0.8598 0.8805 0.8554 0.8569 0.8814 0.8564
dispersion: -0.009331712 hartree
energy: -639.488426010190 hartree
dipole: -19.86250 17.29386 -2.56864 2.97113 -2.88951 0.08162 1.37934 -1.12547 0.25387
magnitude: 2.58245 au
magnitude: 6.56406 debye
