program: Orca
programVersion: 5.0.4
elementType: F N F C F F N C C C C C H H H H H H
charge: 0
multiplicity: 1
keywords: SP DSD-BLYP D3BJ def2-QZVPP def2-QZVPP/C def2/J TightSCF
formula: C6H6F4N2
InChI: InChI=1/C6H6F4N2/c7-6(8,12(9)10)11-4-2-1-3-5-11/h2-5H,1H2
18 atoms
F  1.539681 1.386155 0.677288
N  1.763829 0.034575 0.702462
F  1.070157 -0.367597 1.812926
C  0.961359 -0.497737 -0.445956
F  1.171348 -1.814661 -0.388499
F  1.587449 -0.009173 -1.519559
N  -0.404849 -0.208167 -0.483579
C  -0.847764 1.048999 -0.923699
C  -2.066503 1.506676 -0.666815
C  -3.078972 0.765558 0.150506
C  -2.548958 -0.587132 0.513131
C  -1.318357 -0.996775 0.232718
H  -0.155876 1.613187 -1.529109
H  -2.336462 2.467713 -1.082928
H  -3.337139 1.332617 1.053533
H  -4.019804 0.671206 -0.403388
H  -3.200844 -1.280328 1.026925
H  -0.983188 -1.984734 0.506084
totalener: -739.35601907 hartree
nucrepener: 797.70237567 hartree
electener: -1537.05839475 hartree
oneelecener: -2603.62674774 hartree
twoeener: 1066.56835299 hartree
kineticenergy: 737.79083028 hartree
exchangeener: -26.997290978123 hartree
correlationener: -1.782101055044 hartree
xcener: -28.779392033166 hartree
chargesum: -0.0000000
charge: -0.212492 0.248571 -0.211841 0.657957 -0.248320 -0.249649 -0.317580 0.073825 -0.168440 0.030041 -0.166088 0.066825 0.113086 0.086791 0.049502 0.045944 0.086795 0.115074
charge: 0.168138 -0.160458 0.169435 -1.168117 0.416486 0.414063 0.374623 -0.045989 0.067777 0.081882 0.067496 -0.045405 -0.059123 -0.066148 -0.043962 -0.044653 -0.066249 -0.059797
qa: -0.2125 0.2486 -0.2118 0.6580 -0.2483 -0.2496 -0.3176 0.0738 -0.1684 0.0300 -0.1661 0.0668 0.1131 0.0868 0.0495 0.0459 0.0868 0.1151
va: 0.9510 2.6935 0.9518 4.1623 1.0477 1.0482 3.0757 3.7757 3.8088 3.8354 3.8093 3.7761 0.9950 0.9971 0.9846 0.9814 0.9969 0.9936
total: -740.596355460 hartree
dispersion: -0.011453853 hartree
energy: -740.607809312498 hartree
dipole: -18.13241 17.29032 -0.84209 3.39049 -3.29182 0.09867 -0.94054 0.80936 -0.13118
magnitude: 0.85794 au
magnitude: 2.18070 debye
