program: Orca
programVersion: 5.0.4
elementType: F N F C N C C C C C O H H H H H H
charge: 0
multiplicity: 1
keywords: SP DSD-BLYP D3BJ def2-QZVPP def2-QZVPP/C def2/J TightSCF
formula: C6H6F2N2O
InChI: InChI=1/C6H6F2N2O/c7-10(8)6(11)9-4-2-1-3-5-9/h2-5H,1H2
17 atoms
F  2.822483 -0.224468 1.091471
N  1.617229 -0.64261 0.648891
F  1.895766 -1.170217 -0.600646
C  0.844204 0.574022 0.35061
N  -0.443858 0.270156 0.035993
C  -1.010876 -1.013913 0.134153
C  -2.25051 -1.269061 -0.262063
C  -3.158142 -0.246538 -0.865894
C  -2.519257 1.104378 -0.817311
C  -1.27738 1.314835 -0.402631
O  1.31723 1.668011 0.423166
H  -0.397806 -1.773654 0.590386
H  -2.621794 -2.275411 -0.124601
H  -4.116712 -0.23291 -0.335718
H  -3.409255 -0.515017 -1.899224
H  -3.094364 1.96222 -1.137988
H  -0.8305 2.295854 -0.377461
totalener: -615.06317478 hartree
nucrepener: 628.56427835 hartree
electener: -1243.62745313 hartree
oneelecener: -2090.70075252 hartree
twoeener: 847.07329939 hartree
kineticenergy: 613.68856289 hartree
exchangeener: -23.285698576625 hartree
correlationener: -1.565544996159 hartree
xcener: -24.851243572783 hartree
chargesum: 0.0000000
charge: -0.169144 0.217042 -0.210401 0.408472 -0.320738 0.067804 -0.151919 0.023232 -0.146988 0.078909 -0.370407 0.129082 0.095421 0.053636 0.052703 0.097632 0.145664
charge: 0.199400 -0.167956 0.154181 -0.795214 0.398295 -0.031171 0.075872 0.086809 0.078061 -0.011548 0.334839 -0.064308 -0.061772 -0.040505 -0.040570 -0.061741 -0.052673
qa: -0.1691 0.2170 -0.2104 0.4085 -0.3207 0.0678 -0.1519 0.0232 -0.1470 0.0789 -0.3704 0.1291 0.0954 0.0536 0.0527 0.0976 0.1457
va: 0.9801 2.7591 0.9424 4.2486 3.2271 3.7315 3.8105 3.8362 3.8084 3.7086 2.1072 0.9990 0.9956 0.9814 0.9821 0.9935 0.9912
total: -616.159558697 hartree
dispersion: -0.010988335 hartree
energy: -616.170547032396 hartree
dipole: -17.92135 16.30601 -1.61535 0.80924 -1.32056 -0.51131 -3.52625 3.26914 -0.25711
magnitude: 1.71374 au
magnitude: 4.35598 debye
