program: Orca
programVersion: 5.0.4
elementType: F C N C C C C C N C C C C C H H H H H H H H H H H H
charge: 1
multiplicity: 1
keywords: SP DSD-BLYP D3BJ def2-QZVPP def2-QZVPP/C def2/J TightSCF
formula: C11H12FN2
InChI: InChI=1/C11H12FN2/c12-11(13-7-3-1-4-8-13)14-9-5-2-6-10-14/h3-10H,1-2H2
26 atoms
F  0.026041 -2.155928 0.501563
C  0.011626 -0.882345 0.207042
N  -1.175713 -0.327036 0.0800
C  -2.320525 -0.897529 0.711125
C  -3.486057 -0.269956 0.707075
C  -3.723034 1.046297 0.049933
C  -2.541721 1.45389 -0.760888
C  -1.378004 0.823232 -0.734589
N  1.185995 -0.302369 0.072546
C  1.358586 1.092665 0.299195
C  2.502879 1.699273 0.025738
C  3.688944 1.004846 -0.548544
C  3.494473 -0.472712 -0.537087
C  2.348082 -1.066637 -0.245312
H  -2.176018 -1.84956 1.194522
H  -4.310795 -0.752988 1.212817
H  -4.609025 0.992907 -0.589376
H  -3.961078 1.809907 0.799248
H  -2.639055 2.288015 -1.442376
H  -0.553972 1.093306 -1.377058
H  0.529524 1.596428 0.772322
H  2.580883 2.749351 0.272378
H  4.5844 1.270638 0.020485
H  3.887628 1.35535 -1.567907
H  4.335254 -1.108481 -0.778209
H  2.231794 -2.137881 -0.244142
totalener: -633.73250616 hartree
nucrepener: 875.10388422 hartree
electener: -1508.83639038 hartree
oneelecener: -2581.84751483 hartree
twoeener: 1073.01112445 hartree
kineticenergy: 632.12622555 hartree
exchangeener: -26.251706788060 hartree
correlationener: -1.850435698517 hartree
xcener: -28.102142486577 hartree
chargesum: 1.0000000
charge: -0.179750 0.518599 -0.218896 0.029657 -0.087716 0.001969 -0.091454 0.009618 -0.215236 0.005658 -0.090715 0.002488 -0.086001 0.027746 0.130737 0.128899 0.085048 0.083519 0.131194 0.127580 0.130552 0.131275 0.085999 0.081565 0.127485 0.130181
charge: 0.495964 -0.600187 0.431220 0.012113 0.114268 0.114779 0.115353 -0.003502 0.431314 -0.003867 0.115238 0.114929 0.114361 0.012456 -0.053829 -0.040895 -0.022609 -0.023810 -0.041259 -0.049864 -0.049602 -0.041283 -0.022631 -0.023789 -0.040963 -0.053905
qa: -0.1798 0.5186 -0.2189 0.0297 -0.0877 0.0020 -0.0915 0.0096 -0.2152 0.0057 -0.0907 0.0025 -0.0860 0.0277 0.1307 0.1289 0.0850 0.0835 0.1312 0.1276 0.1306 0.1313 0.0860 0.0816 0.1275 0.1302
va: 1.1325 3.9847 3.2830 3.7307 3.8179 3.8541 3.8258 3.7288 3.2860 3.7304 3.8209 3.8498 3.8224 3.7335 0.9913 0.9850 0.9857 0.9868 0.9843 0.9897 0.9883 0.9844 0.9850 0.9875 0.9852 0.9922
total: -634.981586964 hartree
dispersion: -0.019031439 hartree
energy: -635.000618403185 hartree
dipole: -0.11832 0.11277 -0.00555 8.84920 -8.27726 0.57194 -2.08436 1.94938 -0.13498
magnitude: 0.58768 au
magnitude: 1.49375 debye
