program: Orca
programVersion: 5.0.4
elementType: F C N C C C C C F N C C C C C H H H H H H H H H H H H
charge: 0
multiplicity: 1
keywords: Opt RIJCOSX PBEh-3c
formula: C11H12F2N2
InChI: InChI=1/C11H12F2N2/c12-11(13,14-7-3-1-4-8-14)15-9-5-2-6-10-15/h3-10H,1-2H2
27 atoms
F  -0.248776 -1.692017 -1.818911
C  -0.169087 -1.260934 -0.531728
N  -1.231474 -0.366122 -0.289879
C  -2.405642 -0.387785 -1.049868
C  -3.488027 0.304629 -0.710419
C  -3.574037 1.16602 0.513415
C  -2.342552 0.983478 1.347073
C  -1.290784 0.274642 0.953018
F  -0.28925 -2.394095 0.213776
N  1.085717 -0.678246 -0.251939
C  2.1933 -1.478913 0.054815
C  3.438161 -1.015256 0.044102
C  3.797398 0.395644 -0.308098
C  2.57578 1.125497 -0.775915
C  1.354435 0.60519 -0.744767
H  -2.385901 -0.987738 -1.944977
H  -4.348282 0.241861 -1.36283
H  -4.469046 0.915606 1.094356
H  -3.702252 2.220599 0.237708
H  -2.298196 1.451482 2.320954
H  -0.415694 0.168354 1.577115
H  1.98277 -2.502044 0.321591
H  4.230284 -1.700828 0.31308
H  4.57122 0.409843 -1.084404
H  4.249472 0.906942 0.551263
H  2.683944 2.131022 -1.159175
H  0.496518 1.16347 -1.088654
totalener: -734.01420930 hartree
nucrepener: 1032.57605752 hartree
electener: -1766.59026681 hartree
oneelecener: -3052.71878954 hartree
twoeener: 1286.12852272 hartree
kineticenergy: 728.79928568 hartree
exchangeener: -52.898082799718 hartree
correlationener: -4.885678817293 hartree
xcener: -57.783761617012 hartree
dispersion: -0.017693661 hartree
dispersion: -0.017691514 hartree
dispersion: -0.017682409 hartree
dispersion: -0.017682075 hartree
dispersion: -0.017682148 hartree
dispersion: -0.017684087 hartree
dispersion: -0.017688652 hartree
dispersion: -0.017690235 hartree
energy: -683.4951 -683.4478 -399.6900 -399.6765 -290.7717 -285.2396 -285.2383 -285.2166 -285.2135 -284.2969 -284.2881 -284.1264 -284.1109 -284.1036 -284.0973 -38.2274 -36.2460 -30.2013 -29.0760 -25.0438 -24.4129 -23.4681 -23.3768 -22.0209 -20.6056 -19.6128 -19.2716 -19.2331 -17.9545 -17.7812 -17.2479 -15.7764 -15.5121 -14.7997 -14.5781 -14.3867 -14.3226 -14.1545 -13.7235 -13.6645 -13.4324 -13.3656 -13.2967 -13.0289 -12.6388 -11.9402 -11.6461 -11.6121 -11.5439 -10.7226 -10.6953 -8.7514 -8.5973 -6.6105 -6.4869 0.6466 1.0512 2.2896 2.4050 3.9516 4.0670 4.8824 4.9531 5.0512 5.1014 5.4007 5.6304 5.8435 6.0171 6.1396 6.2166 6.3406 6.4780 6.5180 6.5892 7.7787 7.9096 8.3937 8.6347 8.9499 9.3747 9.4552 9.7634 11.6543 11.7776 12.2252 12.2976 12.7780 13.3742 14.0247 14.3691 14.5308 14.5766 14.8789 15.4221 15.5870 15.9381 16.2718 16.2895 16.4632 16.5986 17.0608 17.1310 17.6629 17.9351 18.2168 18.8047 18.9162 19.0390 19.2804 20.4255 20.8179 20.9825 21.1164 23.0157 23.3823 24.6589 24.8778 25.2312 25.3690 25.7581 25.9347 26.2341 26.4557 26.5289 26.6649 26.8016 27.1032 27.2297 27.3629 28.2057 28.3731 28.4140 28.5624 29.0797 29.5257 30.0276 30.0869 30.6564 31.0942 31.2406 31.6331 31.7788 32.1308 32.9832 33.0282 33.2100 34.1960 34.5743 34.7487 35.3665 35.8670 36.3040 37.1472 37.7817 38.7491 39.0116 39.1843 39.6241 40.3201 41.0977 41.6240 41.7681 42.0733 42.1664 42.2938 42.7924 42.8449 43.5526 45.5471 46.7652 46.8962 48.2894 49.4280 49.5097 49.5961 49.8214 50.9879 52.1439 52.2267 53.4075 54.0399 54.3443 55.3739 55.4870 55.8571 56.6052 56.7402 56.9595 57.4997 57.9650 58.2892 58.8749 59.1283 59.4595 59.6082 60.2995 60.4518 60.9993 61.2572 61.8051 62.9191 64.0734 65.3249 66.0744 66.1523 66.3793 66.6986 67.1785 67.5074 68.9924 69.3045 69.6421 71.7301 71.8839 72.3544 73.3403 73.3967 73.5801 74.3666 74.7570 75.3688 76.4745 76.6994 77.6943 78.6067 80.2322 80.7375 84.1370 86.0235 86.6897 87.7486 91.8963 92.9083 365.0553 365.6438 369.0515 369.5657 378.9042 379.1150 383.5902 386.3825 386.7359 387.6270 387.8384 529.0420 529.1810 896.6108 900.3951 electronvolt
chargesum: -0.0000000
charge: -0.323258 1.084584 -0.644419 0.037351 -0.329578 -0.432862 -0.321235 0.025631 -0.326441 -0.636521 0.037824 -0.326483 -0.433693 -0.321478 0.027277 0.265311 0.222911 0.226974 0.228074 0.223300 0.274575 0.264636 0.222696 0.227175 0.228338 0.223077 0.276235
charge: -0.160654 0.317585 -0.101919 -0.065980 -0.187520 -0.230542 -0.182118 -0.068853 -0.163495 -0.103262 -0.066057 -0.184679 -0.230761 -0.182626 -0.068989 0.150007 0.138940 0.130974 0.129244 0.139449 0.151265 0.149564 0.138910 0.131199 0.129550 0.139255 0.151510
qa: -0.3233 1.0846 -0.6444 0.0374 -0.3296 -0.4329 -0.3212 0.0256 -0.3264 -0.6365 0.0378 -0.3265 -0.4337 -0.3215 0.0273 0.2653 0.2229 0.2270 0.2281 0.2233 0.2746 0.2646 0.2227 0.2272 0.2283 0.2231 0.2762
va: 1.0876 3.9372 3.1396 3.7216 3.8033 3.7174 3.8251 3.7142 1.0819 3.1351 3.7228 3.8043 3.7172 3.8255 3.7081 0.8977 0.9218 0.8938 0.8900 0.9217 0.8883 0.8978 0.9216 0.8936 0.8901 0.9218 0.8858
dispersion: -0.017690001 hartree
energy: -733.970803395665 hartree
dipole: 1.53031 -1.45820 0.07212 11.47509 -10.96876 0.50633 3.64005 -3.49116 0.14889
magnitude: 0.53267 au
magnitude: 1.35393 debye
