program: Orca
programVersion: 5.0.4
elementType: O C N C C C C C N C C C C C H H H H H H H H H H H H
charge: 0
multiplicity: 1
keywords: Opt RIJCOSX PBEh-3c
formula: C11H12N2O
InChI: InChI=1/C11H12N2O/c14-11(12-7-3-1-4-8-12)13-9-5-2-6-10-13/h3-10H,1-2H2
26 atoms
O  -0.454112 2.520957 0.472685
C  -0.241798 1.351639 0.260419
N  1.040935 0.838077 0.138222
C  2.086742 1.716668 -0.174439
C  3.343358 1.307731 -0.302208
C  3.76543 -0.11922 -0.12332
C  2.640927 -0.908579 0.473183
C  1.39941 -0.446487 0.567821
N  -1.26278 0.422217 0.121873
C  -2.526551 0.735655 0.639784
C  -3.568471 -0.077742 0.515196
C  -3.502443 -1.39862 -0.189201
C  -2.199274 -1.519938 -0.916966
C  -1.188427 -0.675351 -0.746067
H  1.794751 2.746722 -0.305759
H  4.094857 2.045577 -0.54774
H  4.083475 -0.553004 -1.080132
H  4.648736 -0.176526 0.521555
H  2.845735 -1.893913 0.869039
H  0.61583 -1.02683 1.031729
H  -2.589036 1.684748 1.148631
H  -4.509796 0.234342 0.94638
H  -4.336052 -1.496247 -0.892969
H  -3.633123 -2.225102 0.521286
H  -2.07462 -2.316637 -1.637518
H  -0.273603 -0.770138 -1.311283
totalener: -609.77515452 hartree
nucrepener: 860.31813526 hartree
electener: -1470.09328979 hartree
oneelecener: -2533.34578727 hartree
twoeener: 1063.25249749 hartree
kineticenergy: 605.17624532 hartree
exchangeener: -46.222675652458 hartree
correlationener: -4.391586189665 hartree
xcener: -50.614261842123 hartree
dispersion: -0.017316305 hartree
dispersion: -0.017319470 hartree
dispersion: -0.017314382 hartree
dispersion: -0.017312396 hartree
dispersion: -0.017308360 hartree
energy: -529.9448 -399.9207 -399.9191 -288.1820 -285.4119 -285.4063 -285.1817 -285.1806 -284.4222 -284.4184 -284.3180 -284.3126 -284.1987 -284.1975 -32.3455 -29.4897 -29.1222 -24.9793 -24.5151 -23.5909 -23.4365 -21.6041 -20.5752 -19.4166 -19.1943 -18.7047 -17.4401 -15.9607 -15.4733 -15.0353 -14.9233 -14.3270 -14.2066 -13.8453 -13.8247 -13.6852 -13.5292 -13.3746 -13.0724 -12.0735 -11.7932 -11.6692 -10.9178 -10.8432 -10.6373 -9.3740 -8.8591 -8.6223 -6.8870 -6.5134 0.5280 0.6887 1.1031 2.3114 3.3910 3.7955 4.1215 4.8289 4.8322 5.2102 5.3337 5.5207 5.8349 5.9221 5.9764 6.0746 6.2736 6.5363 6.6290 7.0506 7.5896 7.8661 8.7081 8.9937 9.0692 9.5529 9.8794 10.3564 11.2627 12.0127 12.3555 13.2200 13.4379 13.7357 13.9679 14.7084 14.9795 15.1029 15.3666 15.6874 15.7851 16.1180 16.3989 16.5129 16.5553 16.9804 17.1470 17.2423 17.6851 17.7960 18.1557 18.8646 19.0826 19.4678 19.8150 20.4709 20.5350 20.7989 21.0730 22.8579 23.9325 24.4694 24.8283 24.9461 25.1950 25.8673 25.9015 26.2204 26.2537 26.2704 26.7318 26.7772 26.9300 27.5104 27.9008 28.1942 28.2717 28.4619 28.5910 29.0049 29.5290 30.0143 30.0932 30.8925 31.0593 32.2687 32.3217 32.7969 33.1644 34.3737 35.2762 35.9288 36.9528 37.0047 37.3054 38.3252 39.1306 39.2028 40.8976 41.0377 41.3108 41.4742 42.4955 42.7870 42.9736 43.1718 43.3910 46.4308 46.9422 47.6594 49.1183 49.3077 49.7245 49.9774 50.0767 50.4024 52.2679 52.3038 53.1918 53.6013 53.6562 55.1035 55.4424 55.7103 56.3670 56.9292 57.2794 58.0156 58.2616 59.0145 59.2677 59.7435 59.7687 60.1858 60.6160 61.6866 62.4757 62.5566 62.7245 64.7423 65.2642 65.6413 65.8099 66.3727 66.8277 67.3362 67.4525 68.4603 70.4137 71.0554 71.2624 71.7272 71.7980 72.6946 73.0125 73.9672 74.8118 74.9302 75.3168 76.6309 76.9289 78.1477 78.4286 80.2347 81.7661 81.8923 86.2324 90.9650 92.3252 94.5720 364.7769 365.3640 369.1557 369.1725 378.7760 378.9428 382.5593 386.1156 386.6362 387.3757 387.6425 526.9353 530.4921 701.6480 electronvolt
chargesum: 0.0000000
charge: -0.413311 0.707998 -0.594992 0.044810 -0.329247 -0.436055 -0.315073 0.006433 -0.595679 0.045197 -0.329107 -0.435758 -0.315092 0.007744 0.279494 0.227364 0.233566 0.229965 0.227366 0.278596 0.279159 0.227291 0.230045 0.233069 0.227099 0.279116
charge: -0.243019 0.150214 -0.090568 -0.057857 -0.180337 -0.231418 -0.178279 -0.073931 -0.090804 -0.057869 -0.180117 -0.231333 -0.178295 -0.073690 0.157951 0.140864 0.132958 0.134051 0.140878 0.152103 0.157821 0.140821 0.134003 0.132732 0.140821 0.152297
qa: -0.4133 0.7080 -0.5950 0.0448 -0.3292 -0.4361 -0.3151 0.0064 -0.5957 0.0452 -0.3291 -0.4358 -0.3151 0.0077 0.2795 0.2274 0.2336 0.2300 0.2274 0.2786 0.2792 0.2273 0.2300 0.2331 0.2271 0.2791
va: 2.2127 4.0628 3.1784 3.6935 3.7991 3.7128 3.8233 3.7038 3.1779 3.6942 3.7996 3.7125 3.8240 3.7032 0.8925 0.9204 0.8884 0.8944 0.9204 0.8823 0.8926 0.9203 0.8940 0.8887 0.9205 0.8818
dispersion: -0.017310576 hartree
energy: -609.743706512057 hartree
dipole: 1.19306 -0.98355 0.20951 -6.69616 5.55044 -1.14572 -1.31306 1.09973 -0.21333
magnitude: 1.18409 au
magnitude: 3.00972 debye
