program: Orca
programVersion: 5.0.4
elementType: O C N C C C C C N C C C C C H H H H H H H H H H H H
charge: 0
multiplicity: 1
keywords: SP DSD-BLYP D3BJ def2-QZVPP def2-QZVPP/C def2/J TightSCF
formula: C11H12N2O
InChI: InChI=1/C11H12N2O/c14-11(12-7-3-1-4-8-12)13-9-5-2-6-10-13/h3-10H,1-2H2
26 atoms
O  -0.403144 2.235139 0.416828
C  -0.190831 1.065821 0.204563
N  1.091903 0.552259 0.082366
C  2.13771 1.43085 -0.230295
C  3.394326 1.021912 -0.358064
C  3.816398 -0.405038 -0.179176
C  2.691895 -1.194397 0.417327
C  1.450377 -0.732305 0.511965
N  -1.211812 0.136399 0.066017
C  -2.475583 0.449837 0.583928
C  -3.517503 -0.36356 0.459339
C  -3.451476 -1.684438 -0.245057
C  -2.148307 -1.805756 -0.972822
C  -1.137459 -0.961169 -0.801923
H  1.845718 2.460904 -0.361615
H  4.145825 1.759759 -0.603596
H  4.134442 -0.838822 -1.135989
H  4.699703 -0.462344 0.465698
H  2.896703 -2.179731 0.813183
H  0.666798 -1.312648 0.975872
H  -2.538069 1.39893 1.092775
H  -4.458828 -0.051476 0.890524
H  -4.285085 -1.782065 -0.948825
H  -3.582155 -2.51092 0.465429
H  -2.023653 -2.602455 -1.693374
H  -0.222635 -1.055956 -1.367139
totalener: -609.36902362 hartree
nucrepener: 860.05096574 hartree
electener: -1469.41998936 hartree
oneelecener: -2532.67061070 hartree
twoeener: 1063.25062134 hartree
kineticenergy: 607.79982020 hartree
exchangeener: -25.765760399204 hartree
correlationener: -1.840277034862 hartree
xcener: -27.606037434066 hartree
chargesum: 0.0000000
charge: -0.441264 0.421493 -0.300178 0.063710 -0.176564 0.022927 -0.171429 0.039649 -0.306868 0.066048 -0.176009 0.020655 -0.171420 0.045267 0.138985 0.090925 0.044495 0.046726 0.094130 0.117746 0.138930 0.092486 0.046387 0.045127 0.092697 0.115347
charge: 0.301751 -0.733363 0.400013 -0.023542 0.065480 0.080896 0.067734 -0.044464 0.399760 -0.023589 0.065448 0.080444 0.067848 -0.043748 -0.052179 -0.068042 -0.046214 -0.043944 -0.067396 -0.052505 -0.052122 -0.067912 -0.043911 -0.046091 -0.067398 -0.052955
qa: -0.4413 0.4215 -0.3002 0.0637 -0.1766 0.0229 -0.1714 0.0396 -0.3069 0.0660 -0.1760 0.0207 -0.1714 0.0453 0.1390 0.0909 0.0445 0.0467 0.0941 0.1177 0.1389 0.0925 0.0464 0.0451 0.0927 0.1153
va: 2.0123 4.1751 3.0907 3.7542 3.7972 3.8342 3.8069 3.7769 3.0925 3.7477 3.7905 3.8365 3.8076 3.7724 0.9952 0.9946 0.9874 0.9835 0.9949 0.9932 0.9949 0.9944 0.9829 0.9866 0.9950 0.9930
total: -610.619485378 hartree
dispersion: -0.019502086 hartree
energy: -610.638987463530 hartree
dipole: 1.19306 -0.96929 0.22377 -6.69616 5.46950 -1.22666 -1.31306 1.08419 -0.22887
magnitude: 1.26773 au
magnitude: 3.22231 debye
