program: Orca
programVersion: 5.0.4
elementType: N C C C C C C N C C C C C H H H H H H H H H H H H
charge: 2
multiplicity: 1
keywords: Freq RIJCOSX PBEh-3c
frequency: 0.00 0.00 0.00 0.00 0.00 0.00 42.34 42.60 101.46 108.71 109.08 295.65 325.80 325.98 395.76 416.18 491.32 491.81 542.29 569.11 569.38 627.57 627.68 684.67 776.21 796.07 800.28 800.39 835.19 915.04 915.13 922.50 942.50 964.98 994.20 1008.98 1010.85 1018.75 1018.94 1060.74 1060.75 1130.29 1130.52 1255.44 1255.57 1263.72 1274.12 1288.16 1288.28 1370.44 1400.90 1400.93 1432.97 1435.18 1464.66 1480.11 1480.41 1480.87 1722.02 1722.31 1774.08 1788.93 2187.45 3077.82 3078.63 3109.15 3109.88 3282.46 3282.51 3283.28 3283.42 3320.97 3321.00 3322.18 3322.52
frequency: 42.34 42.60 101.46 108.71 109.08 295.65 325.80 325.98 395.76 416.18 491.32 491.81 542.29 569.11 569.38 627.57 627.68 684.67 776.21 796.07 800.28 800.39 835.19 915.04 915.13 922.50 942.50 964.98 994.20 1008.98 1010.85 1018.75 1018.94 1060.74 1060.75 1130.29 1130.52 1255.44 1255.57 1263.72 1274.12 1288.16 1288.28 1370.44 1400.90 1400.93 1432.97 1435.18 1464.66 1480.11 1480.41 1480.87 1722.02 1722.31 1774.08 1788.93 2187.45 3077.82 3078.63 3109.15 3109.88 3282.46 3282.51 3283.28 3283.42 3320.97 3321.00 3322.18 3322.52
formula: C11H12N2
InChI: InChI=1/C11H12N2/c1-3-7-12(8-4-1)11-13-9-5-2-6-10-13/h3-10H,1-2H2
25 atoms
N  -1.247276 0.084133 0.005398
C  -1.96137 0.118871 -1.243596
C  -3.285472 0.225142 -1.243802
C  -4.110848 0.313146 -0.022541
C  -3.306828 0.258726 1.21488
C  -1.983005 0.152323 1.240521
C  -0.000125 -0.005129 0.017519
N  1.246766 -0.094415 0.045187
C  2.059973 1.093168 0.04941
C  3.383776 0.986499 0.072918
C  4.112065 -0.298059 0.095957
C  3.208728 -1.466213 0.093487
C  1.883165 -1.385089 0.070099
H  -1.342254 0.053748 -2.125641
H  -3.776612 0.247601 -2.209094
H  -4.862561 -0.487342 -0.017957
H  -4.710573 1.23315 -0.04029
H  -3.81465 0.307565 2.170548
H  -1.379331 0.110798 2.134622
H  1.510935 2.022584 0.031999
H  3.951292 1.909256 0.075471
H  4.775718 -0.338336 0.969932
H  4.80083 -0.35478 -0.757546
H  3.63989 -2.45983 0.111822
H  1.207968 -2.227517 0.067597
totalener: -533.94541251 hartree
nucrepener: 718.95056966 hartree
electener: -1252.89598217 hartree
oneelecener: -2116.62491598 hartree
twoeener: 863.72893381 hartree
kineticenergy: 529.93081256 hartree
exchangeener: -41.237590571893 hartree
correlationener: -3.916542286690 hartree
xcener: -45.154132858583 hartree
energy: -411.6369 -411.6367 -297.2227 -293.9654 -293.9640 -293.9631 -293.9609 -293.1865 -293.1847 -293.1846 -293.1830 -292.3483 -292.3481 -41.0969 -39.9098 -34.2334 -33.6955 -32.4442 -32.4434 -30.8486 -30.0060 -28.4759 -28.4733 -27.5983 -27.0662 -24.2014 -24.1639 -24.0894 -24.0873 -23.1065 -23.1010 -22.3526 -22.2816 -22.2811 -22.2152 -21.1643 -21.1621 -20.0757 -20.0570 -19.4680 -19.4672 -17.3124 -17.2815 -16.3750 -16.3726 -10.3271 -10.3127 -7.7251 -7.5849 -6.2588 -5.8612 -5.8585 -3.6478 -3.5108 -3.3630 -2.8966 -2.8936 -2.5547 -1.8198 -1.2817 -1.2656 -1.2614 -1.2578 -1.0213 -1.0211 -0.8766 -0.8707 -0.8056 0.5889 0.6283 0.8948 0.8964 2.4271 3.0347 3.8083 3.8100 4.3051 5.5469 5.5484 5.6856 5.6891 5.8110 6.5768 6.7613 7.0873 7.3150 7.5695 7.9912 8.2445 8.2541 8.5535 8.5542 8.8103 9.2583 9.2861 9.9708 10.7647 10.7656 11.4672 11.4698 11.8499 12.4955 12.8068 13.5172 13.5320 14.7825 15.6779 17.1433 17.1461 17.4329 17.7817 17.7858 18.4481 18.4496 18.8341 18.8372 18.9759 18.9771 19.8388 19.8610 19.8788 20.1503 20.2533 20.7861 20.8261 22.3591 22.4697 23.1053 23.1071 23.5227 24.9014 24.9143 24.9187 25.2645 25.9807 27.9002 28.1900 28.1936 30.1909 31.0750 31.1723 32.2552 32.6623 32.6634 33.5592 33.7036 33.7428 35.4272 35.4614 35.5780 36.6444 37.5789 40.1236 40.5499 40.5588 41.2228 41.6023 43.1410 43.1444 43.4433 44.9345 46.1415 46.1507 47.1176 47.1855 47.3956 47.4006 50.1465 50.1533 50.6840 50.7957 50.8750 51.8291 52.3859 52.3872 52.5056 53.7802 55.2844 56.2784 57.1555 57.1593 57.8353 57.8436 58.0219 59.2597 59.4307 59.4612 62.6114 63.2256 63.2274 63.2838 63.8143 64.4247 64.6147 65.2131 66.3731 66.3765 67.7010 69.2545 71.8247 71.8282 76.4722 79.5660 79.6139 83.5776 85.4279 355.6807 356.4474 359.8824 359.8851 370.2906 370.7865 376.6461 376.8755 376.8771 379.2014 380.6851 518.5753 521.7278 electronvolt
chargesum: 2.0000000
charge: -0.417102 -0.009749 -0.219124 -0.504226 -0.218260 -0.010856 0.620281 -0.417324 -0.010020 -0.218915 -0.504173 -0.218960 -0.010064 0.337812 0.346577 0.350344 0.350570 0.346534 0.337370 0.337557 0.346594 0.350425 0.350536 0.346554 0.337619
charge: 0.119793 -0.075940 -0.021915 -0.234719 -0.021807 -0.076179 0.226465 0.119769 -0.075975 -0.021904 -0.234693 -0.021905 -0.076028 0.184583 0.202115 0.211949 0.212356 0.202127 0.184390 0.184474 0.202133 0.212083 0.212217 0.202115 0.184496
qa: -0.4171 -0.0097 -0.2191 -0.5042 -0.2183 -0.0109 0.6203 -0.4173 -0.0100 -0.2189 -0.5042 -0.2190 -0.0101 0.3378 0.3466 0.3503 0.3506 0.3465 0.3374 0.3376 0.3466 0.3504 0.3505 0.3466 0.3376
va: 3.5461 3.4797 3.7198 3.5886 3.7190 3.4802 3.5709 3.5460 3.4796 3.7193 3.5887 3.7196 3.4800 0.8540 0.8620 0.8391 0.8388 0.8620 0.8542 0.8541 0.8620 0.8390 0.8389 0.8620 0.8541
dispersion: -0.015273628 hartree
energy: -533.921449899735 hartree
dipole: 0.00099 -0.00096 0.00003 0.02930 -0.02474 0.00457 0.04179 -0.03873 0.00306
magnitude: 0.00550 au
magnitude: 0.01398 debye
temp: 298.15 k
press: 1.00 atm
zeropoint: 0.21284939 hartree
thermalvibcorrection: 0.00815082 hartree
thermalrotcorrection: 0.00141627 hartree
thermaltrasncorrection: 0.00141627 hartree
thermaltotal: -533.69761715 hartree
thermalcorr: 0.01098336 hartree
nonthermalcorr: 0.21284939 hartree
totalcorr: 0.22383275 hartree
thermalcorrenthalpy: 0.00094421 hartree
totalenthalpy: -533.69667294 hartree
vibrat: 0.01399701 hartree
rotat: 0.01483233 hartree
transl: 0.01964122 hartree
total: 0.04847056 hartree
totalentropycorr: -0.04847056 hartree
gibbsenthalpy: -533.74514350 hartree
gibbsminuselec: 0.17630640 hartree
