program: Orca
programVersion: 5.0.4
elementType: O C C C C C C C C C C C C C H H H H H H H H
charge: 0
multiplicity: 1
keywords: Freq RIJCOSX PBEh-3c
frequency: 0.00 0.00 0.00 0.00 0.00 0.00 99.27 135.16 155.55 212.53 279.77 295.04 420.77 427.71 450.98 469.54 526.23 580.29 586.41 643.58 682.72 714.91 760.40 781.98 784.63 809.20 825.93 869.44 936.98 938.14 963.44 1014.15 1017.19 1051.33 1052.88 1055.68 1078.50 1089.30 1134.73 1157.13 1213.20 1215.29 1220.43 1260.85 1278.23 1358.53 1362.57 1387.92 1457.51 1534.44 1539.42 1563.94 1573.94 1708.23 1716.88 1726.52 1735.38 1916.76 3265.31 3266.11 3274.84 3275.76 3282.73 3283.18 3292.64 3293.17
frequency: 99.27 135.16 155.55 212.53 279.77 295.04 420.77 427.71 450.98 469.54 526.23 580.29 586.41 643.58 682.72 714.91 760.40 781.98 784.63 809.20 825.93 869.44 936.98 938.14 963.44 1014.15 1017.19 1051.33 1052.88 1055.68 1078.50 1089.30 1134.73 1157.13 1213.20 1215.29 1220.43 1260.85 1278.23 1358.53 1362.57 1387.92 1457.51 1534.44 1539.42 1563.94 1573.94 1708.23 1716.88 1726.52 1735.38 1916.76 3265.31 3266.11 3274.84 3275.76 3282.73 3283.18 3292.64 3293.17
formula: C13H8O
InChI: InChI=1/C13H8O/c14-13-11-7-3-1-5-9(11)10-6-2-4-8-12(10)13/h1-8H
22 atoms
O  0.247008 2.546702 1.61548
C  0.14763 1.535176 0.97235
C  1.236114 0.793596 0.274266
C  0.689643 -0.324924 -0.359345
C  1.500714 -1.177725 -1.080934
C  2.863163 -0.893133 -1.152002
C  3.4016 0.218533 -0.517398
C  2.582228 1.079785 0.207404
C  -0.759688 -0.354165 -0.092612
C  -1.089083 0.748974 0.699108
C  -2.382072 0.982461 1.114578
C  -3.369467 0.08144 0.724742
C  -3.047512 -1.016452 -0.062267
C  -1.738229 -1.246919 -0.481088
H  1.100221 -2.049536 -1.582314
H  3.513773 -1.551728 -1.712316
H  4.463017 0.414154 -0.588386
H  2.985191 1.951484 0.706617
H  -2.61673 1.842854 1.727898
H  -4.394094 0.234789 1.035569
H  -3.827523 -1.706936 -0.355207
H  -1.505902 -2.108531 -1.09384
totalener: -574.18654449 hartree
nucrepener: 781.12341840 hartree
electener: -1355.30996289 hartree
oneelecener: -2326.56702555 hartree
twoeener: 971.25706266 hartree
kineticenergy: 569.91738085 hartree
exchangeener: -43.821570033536 hartree
correlationener: -4.123420127079 hartree
xcener: -47.944990160615 hartree
energy: -530.5163 -286.8405 -285.0132 -285.0052 -284.8283 -284.8267 -284.7990 -284.7948 -284.7716 -284.7694 -284.6731 -284.6711 -284.6056 -284.5999 -31.6565 -27.4080 -26.2731 -24.7072 -23.6499 -23.2040 -22.4202 -20.6637 -19.6874 -18.5579 -18.1924 -17.5484 -16.0461 -15.9122 -15.1296 -14.3406 -14.3026 -13.9301 -13.6854 -13.6091 -13.5293 -13.3416 -11.9842 -11.7995 -11.7463 -11.6606 -11.3393 -11.0447 -9.3964 -8.5465 -8.5192 -8.3713 -7.4162 -1.8313 -0.6569 0.4475 1.3649 2.4883 3.7369 3.8767 4.7357 5.2410 5.4373 5.6738 5.6942 6.1434 6.2710 6.7354 7.0434 7.3547 7.3778 8.2033 8.2815 8.4761 9.4152 9.5356 10.1482 10.7974 11.4091 12.5511 13.2885 13.8475 13.9967 14.3670 14.5013 14.6784 15.1502 15.1738 15.5775 15.8196 15.8607 15.9592 16.3136 16.6993 16.7778 16.7893 16.8890 17.0422 17.4719 17.5801 18.1793 18.3585 18.7385 19.0199 19.1881 19.4019 19.5889 19.6602 20.7432 21.3431 21.3668 21.5699 23.7060 24.6145 24.6701 25.5097 25.6809 25.9055 26.4097 26.4324 26.9305 26.9355 27.4294 27.9481 28.0129 28.6815 28.8205 28.9950 29.6158 30.3513 30.6268 30.7721 30.8293 31.2425 32.2721 34.3235 34.4132 34.5935 34.9601 35.4936 35.7003 35.9813 37.0829 37.1123 37.3520 38.8362 38.8810 39.0837 40.5130 40.5450 41.2289 41.6478 41.7117 41.8218 41.8436 42.7931 42.9540 43.5343 46.7826 47.7493 48.4522 48.6460 49.6946 49.7080 49.8575 51.3760 52.1141 52.5854 53.6819 54.1262 55.3261 56.1604 56.3269 56.9284 57.3321 57.8260 58.5274 58.6832 59.2429 59.7373 60.4734 61.2681 61.4483 61.9066 62.3230 62.7170 62.7381 63.4227 63.7688 64.4569 64.6422 64.9648 66.1125 66.4136 70.0088 70.9172 70.9522 71.8174 72.5715 73.2182 73.7678 74.2333 74.4230 75.4858 75.5366 76.3130 76.5223 78.0041 78.0862 78.7150 79.1022 81.4684 82.7650 86.2775 89.7201 92.3319 93.3159 98.1036 357.7792 364.5497 369.5218 372.2117 374.5128 377.8534 380.4958 384.0876 385.6679 387.2811 388.0012 396.1935 396.4253 701.4820 electronvolt
chargesum: -0.0000000
charge: -0.306145 0.336958 -0.077160 0.155607 -0.321113 -0.206094 -0.233058 -0.248745 0.154480 -0.077248 -0.248259 -0.233199 -0.205458 -0.320975 0.212083 0.229836 0.229352 0.244195 0.243982 0.229308 0.229517 0.212137
charge: -0.162196 0.125052 -0.079935 -0.013468 -0.127392 -0.110623 -0.134091 -0.088942 -0.013381 -0.079905 -0.088913 -0.134036 -0.110592 -0.127383 0.139435 0.140506 0.140487 0.152465 0.152447 0.140451 0.140524 0.139492
qa: -0.3061 0.3370 -0.0772 0.1556 -0.3211 -0.2061 -0.2331 -0.2487 0.1545 -0.0772 -0.2483 -0.2332 -0.2055 -0.3210 0.2121 0.2298 0.2294 0.2442 0.2440 0.2293 0.2295 0.2121
va: 2.2970 4.0196 3.6228 3.6248 3.7529 3.8142 3.8091 3.7544 3.6251 3.6224 3.7542 3.8089 3.8145 3.7532 0.9204 0.9079 0.9087 0.9083 0.9084 0.9087 0.9080 0.9203
dispersion: -0.015703350 hartree
energy: -574.174019621040 hartree
dipole: -0.43157 0.32421 -0.10736 -4.54105 3.43589 -1.10516 -2.84694 2.15244 -0.69450
magnitude: 1.30967 au
magnitude: 3.32891 debye
temp: 298.15 k
press: 1.00 atm
zeropoint: 0.17543088 hartree
thermalvibcorrection: 0.00642834 hartree
thermalrotcorrection: 0.00141627 hartree
thermaltrasncorrection: 0.00141627 hartree
thermaltotal: -573.98932786 hartree
thermalcorr: 0.00926088 hartree
nonthermalcorr: 0.17543088 hartree
totalcorr: 0.18469176 hartree
thermalcorrenthalpy: 0.00094421 hartree
totalenthalpy: -573.98838365 hartree
vibrat: 0.01041830 hartree
rotat: 0.01480379 hartree
transl: 0.01970533 hartree
total: 0.04492741 hartree
totalentropycorr: -0.04492741 hartree
gibbsenthalpy: -574.03331106 hartree
gibbsminuselec: 0.14070856 hartree
