program: Gaussian 09
title: 000076571
version: EM64L-G09RevD.01
frameworkgroup: C1[X(C14H14O2)]
method: RPBEPBE
basis: SDD
operation: Freq
keyword: #pfreq=noraman
keyword: PBEPBE/SDD
title: #p freq=noraman PBEPBE/SDD
converged: YES YES NO NO
title: Mulliken charges:
elementType: O O C C C C C C C C C C C C C C H H H H H H H H H H H H H H
charge: -0.300315 -0.216164 0.113863 0.430168 0.252508 -0.489385 -0.339251 -0.362019 -0.453650 -0.349607 -0.419869 0.221331 -0.226748 -0.233702 -0.683709 -0.239016 0.242946 0.243250 0.221428 0.215654 0.263698 0.238692 0.302231 0.238816 0.229417 0.208720 0.209139 0.224645 0.228506 0.228423
chargesum: 0.00000
title: Mulliken charges with hydrogens summed into heavy atoms:
elementType: O O C C C C C C C C C C C C C C
charge: -0.300315 -0.216164 0.113863 0.430168 0.252508 -0.003189 0.097830 -0.098321 -0.214958 -0.047376 -0.181053 0.221331 0.002669 -0.005196 -0.041206 -0.010592
polarizability: 2.22007396e+02 1.16857415e+01 1.89394853e+02 5.91922147e-01 -3.12293408e-01 7.54321160e+01
1716.lowfreq: -10.4200 -2.0180 -0.0005 0.0000 0.0004 7.7904 24.6136 29.9437 43.1557
frequency: 24.5848 29.8806 43.0842 71.3093 93.3298 153.2790 176.5739 179.1001 222.2593 229.9275 272.0897 297.0410 356.7991 419.0229 422.1633 469.7418 501.8569 510.2446 529.8227 572.2624 584.8201 638.9601 679.2190 717.2976 736.1702 749.1100 783.9826 786.7043 816.5729 822.1082 866.4006 881.3365 884.5420 921.2184 924.7510 968.6540 986.7426 996.8074 1017.2125 1032.3084 1051.8240 1070.3800 1096.1449 1103.3015 1123.2915 1145.9743 1172.0389 1181.6913 1212.9464 1219.4173 1236.7742 1264.1176 1283.0341 1290.0300 1358.6381 1374.6914 1391.6756 1402.9466 1422.3216 1437.1075 1440.7545 1450.0129 1472.9996 1477.5503 1485.9346 1512.8100 1578.2337 1597.4979 1635.5713 1652.6565 2974.6770 2984.2225 3004.4963 3030.5355 3051.8198 3078.3388 3078.9486 3123.8149 3129.6104 3137.3013 3155.6218 3157.4231 3176.3358 3212.5938
redmass: 7.6165 2.1038 2.6258 3.9852 2.9381 4.5110 4.1259 4.3413 1.0806 5.7362 4.3704 6.0138 3.5409 3.1450 4.3308 3.3264 6.9773 7.2688 2.8025 3.3837 7.4564 3.4674 6.2057 6.4764 1.1794 1.3207 5.3481 1.9575 1.5368 5.5133 1.3219 3.0203 1.6533 2.6556 1.3886 1.3705 1.3517 1.3337 3.7023 2.4983 2.3628 2.4411 2.0504 2.3157 2.3173 1.4842 1.0826 1.3380 1.9195 1.3349 1.9448 1.6552 1.2187 1.3001 1.6763 2.1382 1.2134 3.5702 4.5835 1.1493 2.4373 2.4136 1.0530 1.0423 1.0789 3.8392 7.4048 5.6985 7.0324 10.0949 1.0361 1.0617 1.0609 1.0972 1.1004 1.0999 1.1011 1.0861 1.0873 1.0902 1.0968 1.0964 1.0969 1.0940
irintensity: 1.6890 0.1429 0.1122 0.4588 2.1162 2.7565 2.6090 0.9504 0.0296 0.7684 0.3743 17.1588 0.2758 6.7264 2.3975 0.0217 0.8684 0.3131 0.3886 11.7354 4.6868 0.7526 4.1842 4.3502 12.4685 0.7483 0.4625 66.8885 89.2270 7.1752 0.1333 0.3212 6.7626 50.0415 0.9780 0.7622 5.9939 0.0217 50.2219 4.4208 70.0601 53.3889 231.2358 295.3722 135.2262 2.9602 0.7544 46.7615 31.5410 0.5481 7.9218 7.4472 22.6371 38.1642 34.8472 24.5051 8.5259 20.4871 9.7179 20.8512 5.3582 16.0183 5.1161 13.2970 15.0036 16.2676 28.2461 8.1741 8.8277 191.8167 36.5742 8.4109 21.2235 2.1938 0.1558 56.1953 68.0183 0.8609 2.6038 15.9122 30.8460 29.6881 14.9962 3.0469
temp: 298.150 k
press: 1.00000 atm
elementType: 8 8 6 6 6 6 6 6 6 6 6 6 6 6 6 6 1 1 1 1 1 1 1 1 1 1 1 1 1 1
symmnumber: 1
zpe: 632868.8 jmol-1
zpe.correction: 0.241047 hartree
zpe.thermalcorrener: 0.255648 hartree
zpe.thermalcorrenthalpy: 0.256592 hartree
zpe.thermalcorrgfe: 0.197248 hartree
zpe.sumelectzpe: -691.208178 hartree
zpe.sumelectthermal: -691.193577 hartree
zpe.sumelectthermalent: -691.192633 hartree
zpe.sumelectthermalfe: -691.251977 hartree
dipole: -0.1735 -1.7796 0.0348
dipole: 1.7884
quadrupole: -79.9395 -88.8262 -98.0323
quadrupole: -6.5229 0.1679 -0.0584
quadrupole: 8.9932 0.1065 -9.0997 -6.5229 0.1679 -0.0584
hfenergy: -691.4492246 hartree
pointgroup: C01 [X(C14H14O2)]
dipole: -0.0275712 0.67827 -0.1850194 debye
polarizability: 220.5469009|-13.198904|183.8296134|2.84341|-27.6003226|82.4578501 unknown
InChI: InChI=1S/C14H14O2/c1-2-6-14(15)16-13-10-5-8-11-7-3-4-9-12(11)13/h3-5,7-10H,2,6H2,1H3
charge 0 multiplicity 1
30 atoms
O  1.052534 0.022703 0.020661
O  2.451724 -1.82191 0.475447
C  -1.318938 0.329289 -0.048262
C  -2.6703 -0.175178 0.08428
C  -0.22967 -0.586621 0.179162
C  3.404888 0.383508 -0.117575
C  4.815817 -0.167759 0.17013
C  -1.116526 1.704683 -0.396784
C  -2.879544 -1.550648 0.432971
C  -0.447556 -1.925257 0.519011
C  -3.767203 0.721761 -0.138627
C  2.302226 -0.622567 0.167712
C  -1.792032 -2.397419 0.643225
C  -2.208136 2.55133 -0.60677
C  5.912816 0.862279 -0.169788
C  -3.544804 2.057872 -0.477245
H  3.31609 0.691365 -1.179127
H  3.20352 1.296915 0.474736
H  4.969442 -1.096079 -0.410471
H  4.884027 -0.458728 1.235195
H  -0.093174 2.076135 -0.49485
H  -3.905061 -1.924488 0.531581
H  0.39224 -2.599001 0.687012
H  -4.788925 0.336803 -0.037573
H  -1.953441 -3.447341 0.90971
H  5.882785 1.142003 -1.239919
H  5.79341 1.788541 0.423499
H  6.91744 0.454632 0.04256
H  -2.042622 3.601138 -0.872793
H  -4.391128 2.73294 -0.645006
