program: Gaussian 09
title: 000076537
version: EM64L-G09RevD.01
frameworkgroup: C1[X(C10H10O2)]
method: RPBEPBE
basis: SDD
operation: Freq
keyword: #pfreq=noraman
keyword: PBEPBE/SDD
title: #p freq=noraman PBEPBE/SDD
converged: NO YES NO YES
title: Mulliken charges:
elementType: O O C C C C C C C C C C H H H H H H H H H H
charge: -0.431308 -0.431310 0.204742 0.204736 -0.583990 -0.583987 -0.218097 -0.218095 0.096222 0.096227 -0.357465 -0.357470 0.228897 0.228862 0.228905 0.228854 0.215846 0.215846 0.251766 0.251768 0.364525 0.364525
chargesum: 0.00000
title: Mulliken charges with hydrogens summed into heavy atoms:
elementType: O O C C C C C C C C C C
charge: -0.066784 -0.066785 0.204742 0.204736 -0.126230 -0.126228 -0.002251 -0.002249 0.096222 0.096227 -0.105699 -0.105702
polarizability: 1.29445558e+02 -2.36217388e-06 1.38053054e+02 -1.30590831e-03 -4.15341643e-03 5.34485454e+01
1716.lowfreq: -15.7886 -14.1872 0.0005 0.0010 0.0011 13.6976 89.4093 90.9701 116.0826
frequency: 89.4083 90.9392 116.0772 168.1712 193.2774 247.3945 266.7342 313.7656 356.2429 387.2750 454.6574 462.6876 477.9764 480.1807 528.4566 560.7558 652.9110 686.2995 692.9532 719.9652 761.8998 817.1194 920.0175 938.2235 955.1197 956.2804 972.6485 979.4227 988.3801 1035.6476 1122.8027 1128.2776 1152.0169 1181.1407 1203.0059 1206.9031 1209.8051 1271.1212 1300.1842 1334.6229 1338.4507 1379.6794 1410.6372 1444.8939 1456.0103 1461.5729 1478.9954 1617.4502 1623.5462 1704.8047 2904.9702 2905.4658 2932.0644 2932.2309 3104.5638 3135.9755 3160.7121 3181.7092 3584.5929 3585.7992
redmass: 1.8910 2.4727 1.4682 4.3734 1.4930 5.0144 1.8742 5.5725 4.9549 2.1414 7.6821 6.2017 3.7573 7.0135 3.6669 3.1344 4.9303 1.1790 4.5708 7.2299 5.5604 1.4469 4.1204 1.3656 1.7934 1.4856 3.5767 2.4426 1.4854 2.7352 1.3742 1.8532 1.1425 1.0836 2.6708 1.0789 1.0908 1.4704 3.3205 2.1009 2.2988 1.5445 3.6168 1.5419 1.8665 1.5121 2.1802 7.6648 6.7455 6.5214 1.0577 1.0583 1.0981 1.0981 1.0839 1.0997 1.0882 1.0977 1.0654 1.0656
irintensity: 0.0001 0.3950 75.6284 73.5837 0.0001 4.0406 125.7252 0.3192 0.0000 0.0000 0.3415 1.6319 0.0000 0.8789 38.3283 0.2540 0.3900 69.0206 0.0000 30.0937 14.1852 42.2578 0.4400 0.0000 4.4696 0.0000 36.5700 0.2202 0.0000 2.0320 260.1977 9.7164 18.1917 2.6859 171.3513 1.4459 0.0000 19.4790 7.3929 18.5376 1.7143 0.4067 1.4113 3.3136 89.8068 96.3419 0.0749 2.7676 2.0147 8.3595 3.0870 78.0849 0.0012 45.3252 6.0870 58.5318 4.3478 6.3847 38.1049 6.9600
temp: 298.150 k
press: 1.00000 atm
elementType: 8 8 6 6 6 6 6 6 6 6 6 6 1 1 1 1 1 1 1 1 1 1
symmnumber: 1
zpe: 452935.4 jmol-1
zpe.correction: 0.172514 hartree
zpe.thermalcorrener: 0.183348 hartree
zpe.thermalcorrenthalpy: 0.184292 hartree
zpe.thermalcorrgfe: 0.136341 hartree
zpe.sumelectzpe: -536.624842 hartree
zpe.sumelectthermal: -536.614008 hartree
zpe.sumelectthermalent: -536.613064 hartree
zpe.sumelectthermalfe: -536.661015 hartree
dipole: -3.7461 0.0000 0.0004
dipole: 3.7461
quadrupole: -67.7668 -64.7522 -74.1839
quadrupole: 0.0000 0.0000 -0.0042
quadrupole: 1.1342 4.1488 -5.2830 0.0000 0.0000 -0.0042
hfenergy: -536.7973562 hartree
pointgroup: C01 [X(C10H10O2)]
dipole: 1.4738454 0.0000184 -0.0001726 debye
dipolederiv: -0.1158122 -0.0111732 -0.0001707 -0.0764953 -1.3526916 -0.0000606 -0.0001629 0.0000806 -0.4150667 -0.1158178 0.0112048 0.0000862 0.0765336 -1.3526928 -0.0000532 0.0000839 0.0000583 -0.4150694 0.0961019 -0.2430302 -0.0000066 0.0712509 -0.1431232 -0.0000175 0.0000231 0.0000237 -0.0658902 0.0960942 0.2430387 -0.0000099 -0.071244 -0.1431202 -0.0000047 -0.0000395 -0.0000169 -0.065891 -0.0194606 -0.0074247 -0.0000187 -0.086065 -0.0067318 0.0000131 -0.0000291 0.000026 0.2503753 -0.019462 0.0074231 -0.0000107 0.086064 -0.0067279 0.0000276 -0.0000218 0.0000957 0.250375 0.2013846 0.0912501 0.0000424 0.1458484 0.0707842 0.0000085 0.0000346 0.0000143 -0.2342589 0.2013932 -0.0912448 0.0000244 -0.1458431 0.0707756 -0.0000041 0.0000371 -0.0000342 -0.234259 -0.1595213 -0.0017134 0.0000483 0.0265732 1.187382 0.0000814 0.0000439 0.000046 0.0302377 -0.1595161 0.0016734 -0.0000279 -0.0266145 1.187383 0.000057 -0.0000188 0.0000269 0.0302397 0.0883816 0.1971537 0.0000054 -0.18541 -0.1018614 0.0000038 -0.0000327 -0.0000459 -0.1722452 0.088378 -0.197146 -0.0000185 0.185417 -0.1018636 -0.0000057 0.0000176 -0.0000161 -0.1722468 -0.0086922 -0.0346931 0.0087028 0.0389052 -0.0607266 0.1087356 -0.0096705 0.1389812 -0.0365256 -0.0087086 -0.0347098 -0.0087048 0.0388976 -0.0607519 -0.1087596 0.0096694 -0.1390283 -0.0365808 -0.0086983 0.0346862 -0.0087003 -0.0389103 -0.060693 0.1087326 0.0096759 0.1389878 -0.0365601 -0.0087012 0.0347213 0.0087148 -0.038888 -0.0607851 -0.1087606 -0.0096548 -0.1390208 -0.0365458 -0.1454638 0.0749226 -0.0000181 0.0942357 0.018768 0.0000032 -0.0000199 0.0000082 0.1607914 -0.1454599 -0.0749284 -0.000016 -0.0942419 0.0187622 -0.0000093 -0.0000176 -0.0000083 0.1607912 -0.0260316 -0.0728917 -0.0000038 -0.0794451 0.0530502 -0.0000047 -0.0000059 -0.0000076 0.1692262 -0.0260338 0.0728879 0.0000116 0.0794408 0.0530567 -0.0000085 0.0000126 -0.0000062 0.1692273 0.0978205 0.0814902 0.0001394 0.069802 0.3959055 0.0000153 0.0001444 -0.0000902 0.3499373 0.0978254 -0.0814968 -0.0000692 -0.0698113 0.3959017 0.0000103 -0.0000693 -0.000074 0.3499384 unknown
polarizability: 129.4455584|-0.0001373|138.0530536|-0.001306|0.0041534|53.4485454 unknown
InChI: InChI=1S/C10H10O2/c11-9-5-6-10(12)8-4-2-1-3-7(8)9/h1-2,5-6,11-12H,3-4H2
charge 0 multiplicity 1
22 atoms
O  -1.131084 -2.810863 -0.00012
O  -1.131169 2.810855 0.000094
C  0.196476 -0.70937 -0.000072
C  0.196454 0.709404 -0.000022
C  1.489048 -1.517357 -0.000096
C  1.489002 1.517432 -0.000069
C  2.746659 -0.676962 0.000011
C  2.746637 0.677074 0.000022
C  -1.046538 -1.400009 -0.000085
C  -1.046585 1.400002 0.000064
C  -2.272363 -0.703252 -0.000005
C  -2.272389 0.703209 0.000074
H  1.518429 -2.191515 0.887262
H  1.518512 -2.191368 -0.887569
H  1.5184 2.191445 -0.887539
H  1.518401 2.191586 0.887295
H  3.700299 -1.221069 0.00008
H  3.70026 1.221212 0.000102
H  -3.206464 -1.271833 -0.000016
H  -3.206507 1.271758 0.000127
H  -0.232539 -3.223626 -0.000558
H  -0.232639 3.223645 0.000321
