program: Orca
programVersion: 5.0.4
elementType: C C C C C C O C C C C C C C H H H H H H H H
charge: 2
multiplicity: 1
keywords: Opt RIJCOSX PBEh-3c
formula: C13H8O
InChI: InChI=1/C13H8O/c1-3-7-12-10(5-1)9-11-6-2-4-8-13(11)14-12/h1-8H
22 atoms
C  -0.13978 0.73344 -1.293306
C  -0.138965 1.374481 -2.557318
C  0.968028 1.259737 -3.340652
C  2.093282 0.520679 -2.906755
C  2.129997 -0.115997 -1.684277
C  1.035456 -0.039377 -0.843719
O  1.042722 -0.642903 0.334534
C  0.051541 -0.62996 1.211873
C  0.163732 -1.299469 2.415754
C  -0.885661 -1.269022 3.309505
C  -2.08674 -0.571753 3.041487
C  -2.257165 0.106483 1.874053
C  -1.201122 0.098036 0.92913
C  -0.958975 0.594062 -0.26899
H  -1.014027 1.933715 -2.859167
H  0.988785 1.742084 -4.308807
H  2.958304 0.451567 -3.554116
H  2.999345 -0.679394 -1.363007
H  1.079931 -1.837429 2.633677
H  -0.783784 -1.79842 4.248334
H  -2.881678 -0.578516 3.775374
H  -3.163224 0.647858 1.638495
totalener: -573.35118252 hartree
nucrepener: 780.07363469 hartree
electener: -1353.42481720 hartree
oneelecener: -2290.65536580 hartree
twoeener: 937.23054860 hartree
kineticenergy: 569.23858611 hartree
exchangeener: -43.463684951819 hartree
correlationener: -4.032260908243 hartree
xcener: -47.495945860062 hartree
dispersion: -0.015026608 hartree
energy: -543.0612 -298.1996 -297.1122 -297.1077 -295.6265 -295.6222 -294.0395 -294.0362 -293.7796 -293.7771 -293.5520 -293.5492 -293.3242 -293.3234 -44.3465 -37.1119 -36.3835 -34.4997 -33.4748 -32.9867 -32.1023 -30.2185 -30.0122 -28.4453 -28.3445 -26.8836 -26.5438 -25.3341 -25.1922 -24.9863 -23.5786 -23.5441 -23.1009 -22.6427 -22.5702 -22.1834 -21.9225 -21.1024 -20.7910 -20.4869 -20.2945 -20.1332 -19.0828 -17.7316 -17.1430 -16.6607 -13.0633 -11.9595 -9.7476 -8.4045 -8.0208 -6.7736 -4.7268 -4.0044 -3.9978 -3.5511 -3.0581 -2.8531 -2.6753 -2.2724 -2.1531 -1.8688 -1.6754 -0.9329 -0.9007 -0.6720 0.0710 0.1687 0.2890 1.1023 1.3830 1.3871 2.0625 3.2634 3.2811 3.5687 4.4717 4.7096 5.2923 5.7385 5.8250 5.8782 6.3267 6.5426 6.8692 7.3953 7.6896 7.7357 7.7688 7.9784 8.2605 8.3513 8.3878 8.7712 8.8470 9.0185 9.0933 9.8511 9.9294 10.4078 10.9609 11.0784 11.5856 11.6920 12.1330 13.0588 13.4349 15.8508 16.4819 16.8160 17.4566 17.7004 17.7047 17.9496 18.1483 18.4529 18.6120 19.3369 19.3748 19.4693 19.7059 20.2702 20.4146 20.7644 21.6351 21.9236 21.9763 22.5639 23.8125 24.4027 24.4491 24.8022 25.0675 25.1125 25.5372 26.3696 26.7593 27.9943 28.5463 28.9996 29.4372 30.1361 30.3732 31.2516 31.2529 32.3065 32.4193 32.9806 33.0533 33.8654 34.5856 35.0847 35.3365 36.1708 37.0293 37.8289 39.8295 41.6438 41.9848 42.0040 43.1411 43.4169 44.0235 44.4287 45.5666 45.6867 46.2657 46.5695 47.7065 48.3506 48.5696 49.3772 49.5722 50.1881 50.4417 50.5663 52.1175 52.2527 52.5713 52.9040 53.2860 53.5374 53.7629 54.9216 55.2906 56.4384 56.6840 58.6081 60.1649 60.7090 61.6131 62.1062 63.6894 64.1313 64.7728 65.1911 65.2117 65.4785 66.7398 66.7910 66.8098 68.0889 68.2000 70.2187 70.7307 73.2344 75.6809 78.2548 81.5334 83.1746 86.0008 87.5601 349.1446 355.5912 359.3480 362.5929 363.7004 368.4974 370.4203 375.0742 376.9202 377.5281 383.1385 386.6745 387.5380 691.5543 electronvolt
chargesum: 2.0000000
charge: 0.062604 -0.200889 -0.190892 -0.161225 -0.272268 0.340898 -0.375406 0.341794 -0.272572 -0.160240 -0.192292 -0.200167 0.061927 0.426655 0.333731 0.349625 0.354320 0.358576 0.358308 0.354063 0.349854 0.333598
charge: -0.044669 -0.045846 -0.051394 0.015866 -0.103836 0.177922 0.040221 0.177803 -0.103884 0.015834 -0.051448 -0.045881 -0.044906 0.419743 0.204748 0.202024 0.202791 0.212759 0.212717 0.202760 0.202016 0.204658
qa: 0.0626 -0.2009 -0.1909 -0.1612 -0.2723 0.3409 -0.3754 0.3418 -0.2726 -0.1602 -0.1923 -0.2002 0.0619 0.4267 0.3337 0.3496 0.3543 0.3586 0.3583 0.3541 0.3499 0.3336
va: 3.4901 3.6328 3.7205 3.6963 3.6924 3.7518 2.3758 3.7513 3.6925 3.6968 3.7205 3.6329 3.4914 2.8023 0.8670 0.8531 0.8493 0.8472 0.8474 0.8494 0.8530 0.8670
dispersion: -0.015026748 hartree
energy: -573.335060671821 hartree
dipole: 0.09851 -0.65000 -0.55149 -0.06810 0.40880 0.34070 0.02723 -0.19628 -0.16905
magnitude: 0.66992 au
magnitude: 1.70281 debye
