program: Orca
programVersion: 5.0.4
elementType: C F F P H H H
charge: 0
multiplicity: 1
keywords: Freq RIJCOSX PBEh-3c
frequency: 0.00 0.00 0.00 0.00 0.00 0.00 184.79 298.21 367.20 542.58 674.25 857.02 958.31 1137.93 1167.48 1187.78 1400.81 1423.85 2494.89 2505.48 3128.54
frequency: 184.79 298.21 367.20 542.58 674.25 857.02 958.31 1137.93 1167.48 1187.78 1400.81 1423.85 2494.89 2505.48 3128.54
formula: CH3F2P
InChI: InChI=1/CH3F2P/c2-1(3)4/h1H,4H2
7 atoms
C  -0.690493 -0.11212 -0.087346
F  -1.348316 0.745642 -0.907552
F  -0.911579 0.291376 1.187562
P  1.117092 -0.095847 -0.56791
H  -1.122968 -1.109179 -0.208807
H  1.404789 1.14372 0.046488
H  1.551574 -0.863592 0.537366
totalener: -580.06851132 hartree
nucrepener: 172.44246217 hartree
electener: -752.51097349 hartree
oneelecener: -1146.71660568 hartree
twoeener: 394.20563219 hartree
kineticenergy: 578.27810976 hartree
exchangeener: -27.440360265561 hartree
correlationener: -1.992676895713 hartree
xcener: -29.433037161275 hartree
energy: -2115.5741 -683.2662 -683.2438 -288.8496 -185.7593 -133.7921 -133.7885 -133.7322 -37.6479 -35.9852 -22.1996 -19.3499 -17.1524 -16.8243 -15.5471 -13.7121 -13.0352 -12.9862 -12.1805 -10.5352 -8.8439 1.2707 1.5883 3.9764 4.6125 4.8799 6.1415 10.0364 12.5723 13.2856 13.6444 14.0453 15.3142 15.5713 17.5506 18.0888 20.1269 20.3637 21.9862 24.6058 26.6578 28.9506 30.3578 31.9947 32.1659 33.1285 33.5473 33.7598 34.2902 34.4923 34.9637 35.2177 36.0814 37.1129 37.5304 46.4448 48.8428 51.4532 52.1422 58.5899 59.2480 62.3100 63.6187 66.8663 79.8986 82.4055 378.5735 888.6098 894.8599 electronvolt
chargesum: -0.0000000
charge: 0.340263 -0.327636 -0.322824 -0.066002 0.177183 0.105237 0.093778
charge: 0.123108 -0.194771 -0.193997 0.076007 0.104358 0.047037 0.038258
qa: 0.3403 -0.3276 -0.3228 -0.0660 0.1772 0.1052 0.0938
va: 3.7802 1.0398 1.0444 2.9192 0.9043 0.9626 0.9616
dispersion: -0.002156522 hartree
energy: -580.051873765092 hartree
dipole: 2.82776 -2.50740 0.32036 -1.66476 1.22061 -0.44415 0.61032 -0.44570 0.16462
magnitude: 0.57184 au
magnitude: 1.45349 debye
temp: 298.15 k
press: 1.00 atm
zeropoint: 0.04175684 hartree
thermalvibcorrection: 0.00184716 hartree
thermalrotcorrection: 0.00141627 hartree
thermaltrasncorrection: 0.00141627 hartree
thermaltotal: -580.00543722 hartree
thermalcorr: 0.00467971 hartree
nonthermalcorr: 0.04175684 hartree
totalcorr: 0.04643654 hartree
thermalcorrenthalpy: 0.00094421 hartree
totalenthalpy: -580.00449301 hartree
vibrat: 0.00292494 hartree
rotat: 0.01201443 hartree
transl: 0.01862439 hartree
total: 0.03356376 hartree
totalentropycorr: -0.03356376 hartree
gibbsenthalpy: -580.03805678 hartree
gibbsminuselec: 0.01381699 hartree
