program: Orca
programVersion: 5.0.4
elementType: C P O H H H
charge: 0
multiplicity: 1
keywords: Freq RIJCOSX PBEh-3c
frequency: 0.00 0.00 0.00 0.00 0.00 0.00 186.73 379.48 629.51 711.46 927.22 1011.11 1156.57 1438.16 1885.69 2499.73 2525.78 2964.86
frequency: 186.73 379.48 629.51 711.46 927.22 1011.11 1156.57 1438.16 1885.69 2499.73 2525.78 2964.86
formula: CH3OP
InChI: InChI=1/CH3OP/c2-1-3/h1H,3H2
6 atoms
C  -0.838748 -0.1197 -0.055581
P  0.846203 0.590866 -0.395179
O  -1.589894 0.292139 0.779339
H  -1.131318 -0.926857 -0.75745
H  1.503371 -0.65367 -0.518925
H  1.210386 0.817224 0.947696
totalener: -455.80659205 hartree
nucrepener: 95.43468544 hartree
electener: -551.24127749 hartree
oneelecener: -817.62672109 hartree
twoeener: 266.38544359 hartree
kineticenergy: 454.61615380 hartree
exchangeener: -20.745881766511 hartree
correlationener: -1.495911536450 hartree
xcener: -22.241793302961 hartree
energy: -2115.6245 -531.0200 -287.1689 -185.8226 -133.8544 -133.8497 -133.8016 -32.1007 -21.2022 -17.8029 -14.7739 -13.7018 -12.7027 -12.3294 -9.4494 -8.1788 -0.3663 1.4498 1.6854 4.3782 5.8293 6.8092 9.7592 13.5056 13.5471 13.9929 15.0510 15.6685 17.4056 18.0226 19.6196 20.1550 21.4781 22.3854 25.5551 26.0724 27.3290 29.5279 30.5852 32.4618 33.8943 42.8181 44.5081 47.9854 50.8678 53.8399 55.3331 60.5422 65.2837 71.3338 74.9705 80.3779 372.9316 695.2039 electronvolt
chargesum: 0.0000000
charge: -0.030508 -0.062261 -0.290182 0.172921 0.092863 0.117165
charge: -0.079095 0.065843 -0.169665 0.088388 0.040648 0.053881
qa: -0.0305 -0.0623 -0.2902 0.1729 0.0929 0.1172
va: 3.8684 2.9425 2.2088 0.9001 0.9636 0.9633
dispersion: -0.001879521 hartree
energy: -455.800096053610 hartree
dipole: 0.94558 -0.29859 0.64698 -1.88809 1.38124 -0.50685 0.08031 -0.42346 -0.34314
magnitude: 0.89063 au
magnitude: 2.26381 debye
temp: 298.15 k
press: 1.00 atm
zeropoint: 0.03717130 hartree
thermalvibcorrection: 0.00127568 hartree
thermalrotcorrection: 0.00141627 hartree
thermaltrasncorrection: 0.00141627 hartree
thermaltotal: -455.75881652 hartree
thermalcorr: 0.00410823 hartree
nonthermalcorr: 0.03717130 hartree
totalcorr: 0.04127953 hartree
thermalcorrenthalpy: 0.00094421 hartree
totalenthalpy: -455.75787231 hartree
vibrat: 0.00203308 hartree
rotat: 0.01089496 hartree
transl: 0.01819440 hartree
total: 0.03112244 hartree
totalentropycorr: -0.03112244 hartree
gibbsenthalpy: -455.78899475 hartree
gibbsminuselec: 0.01110130 hartree
