program: Orca
programVersion: 5.0.4
elementType: C P H H H
charge: 2
multiplicity: 1
keywords: SP DSD-BLYP D3BJ def2-QZVPP def2-QZVPP/C def2/J TightSCF
formula: CH3P
InChI: InChI=1/CH3P/c1-2/h1H,2H2
5 atoms
C  1.172995 -0.005909 -0.002177
P  -0.461638 0.002313 0.000861
H  2.27574 -0.011222 -0.003984
H  -1.026825 1.313656 0.003096
H  -1.040393 -1.303104 0.000361
totalener: -379.83335929 hartree
nucrepener: 49.00646772 hartree
electener: -428.83982701 hartree
oneelecener: -607.49930087 hartree
twoeener: 178.65947386 hartree
kineticenergy: 379.44801924 hartree
exchangeener: -8.753685940422 hartree
correlationener: -0.442335721031 hartree
xcener: -9.196021661453 hartree
energy: -2162.4935 -313.6079 -211.0284 -156.6076 -156.5468 -156.5028 -39.6279 -33.9311 -30.1077 -29.1180 -24.7448 -16.3261 -14.4238 -11.7773 -10.1804 -7.5910 -7.4012 -6.8237 -6.5834 -5.6373 -5.6215 -5.4783 -4.1767 -3.8325 -2.9588 -2.3679 -1.7626 -0.6348 0.0113 0.2547 0.7022 1.9867 2.7398 3.9120 5.7233 5.7893 6.7731 7.0800 7.8168 8.0245 8.7320 9.3547 9.8653 10.2708 11.1540 11.1724 13.1549 13.9703 14.4365 14.5976 15.1498 15.3178 16.6051 16.9942 17.9195 18.0597 18.1429 19.1535 19.1979 20.0858 22.6002 23.4398 26.2984 26.4857 26.6912 28.7811 29.4091 29.4713 35.6626 35.8495 36.0489 39.0319 39.6765 39.9344 40.0540 41.6242 42.5648 43.6346 44.0318 44.2294 46.1707 46.2789 47.5884 48.3387 50.5291 50.8386 51.5878 51.7806 52.7414 53.7899 54.4945 55.0247 55.8156 58.0679 58.5245 58.7606 60.0277 60.3779 60.4853 60.6645 61.0053 61.9224 63.7992 64.9636 65.0090 65.6733 66.1568 66.3581 67.5363 68.8338 70.0424 70.2266 73.8499 75.5363 76.0007 77.4387 79.2366 79.8232 81.4912 82.8298 83.2181 83.5587 87.2691 87.9589 88.3278 91.7871 91.9768 99.6165 101.3032 109.7332 110.3838 113.3255 119.7258 119.9476 119.9641 121.5545 128.6592 133.2864 135.6107 140.2252 140.4984 141.1227 147.1800 147.5988 148.0162 148.1565 149.7614 150.1226 150.5448 150.8390 151.0467 151.0690 153.1296 153.9780 154.4612 156.1500 156.3318 157.3490 159.9351 160.5742 161.4484 162.8628 163.1261 165.3977 168.5354 168.8191 171.0513 171.0760 171.8186 179.8370 180.5410 182.1450 191.0118 191.7290 191.9221 192.2399 192.7748 193.2691 198.3423 199.4854 200.0186 200.0522 204.9739 205.0725 205.2094 205.9126 207.8401 208.0799 209.1140 210.0254 210.1309 212.3346 212.6949 222.1174 222.8606 223.5487 226.4441 228.4215 228.9911 230.1970 232.2168 233.0298 234.7249 260.7681 261.9223 262.5831 265.4727 271.7733 324.3831 476.4360 510.9462 511.6486 559.3224 773.2567 1936.7369 4033.7820 10448.5285 electronvolt
chargesum: 2.0000000
charge: 0.378543 0.710938 0.316995 0.296776 0.296748
charge: 0.599212 1.381081 -0.017465 0.018589 0.018583
qa: 0.3785 0.7109 0.3170 0.2968 0.2967
va: 2.8445 3.6624 0.9046 0.9150 0.9150
total: -379.969972719 hartree
dispersion: -0.002114055 hartree
energy: -379.972086773746 hartree
dipole: 0.60809 -0.32351 0.28458 -0.00269 0.00129 -0.00141 -0.00126 0.00077 -0.00049
magnitude: 0.28458 au
magnitude: 0.72335 debye
