program: Orca
programVersion: 5.0.4
elementType: P C F P H H H H
charge: 1
multiplicity: 1
keywords: Opt RIJCOSX PBEh-3c
formula: CH4FP2
InChI: InChI=1/CH4FP2/c2-1(3)4/h3-4H2
8 atoms
P  -1.499369 0.541161 -0.298752
C  -0.034054 -0.033149 0.522753
F  -0.11672 -0.118626 1.810431
P  1.527529 -0.509314 -0.174223
H  -1.328782 -0.098877 -1.537288
H  -2.461158 -0.269832 0.32984
H  1.514857 0.291848 -1.327806
H  2.397798 0.196889 0.675043
totalener: -821.61963162 hartree
nucrepener: 211.55028183 hartree
electener: -1033.16991345 hartree
oneelecener: -1546.00866222 hartree
twoeener: 512.83874877 hartree
kineticenergy: 819.90303810 hartree
exchangeener: -34.492823195349 hartree
correlationener: -2.317561596284 hartree
xcener: -36.810384791633 hartree
dispersion: -0.003446478 hartree
dispersion: -0.003447269 hartree
dispersion: -0.003450103 hartree
dispersion: -0.003448871 hartree
energy: -2121.9132 -2121.9099 -690.7553 -294.9540 -192.1090 -192.1054 -140.1522 -140.1484 -140.1246 -140.1214 -140.0948 -140.0909 -44.5480 -29.2947 -26.4886 -24.7629 -22.0926 -21.8348 -21.0346 -18.6635 -18.1501 -17.6699 -15.3807 -14.3459 -8.4155 -4.8892 -4.0385 -3.6590 -2.8540 -1.6696 -0.3343 -0.2991 2.5942 4.2510 6.9250 7.2359 7.5383 8.0413 8.6299 8.7925 9.0351 9.2771 10.3921 11.2479 11.9779 13.8431 14.6020 14.7269 15.8387 16.2167 16.4575 18.0461 19.4864 21.4688 24.8762 25.2756 25.9205 27.1029 27.7546 28.3619 28.8290 29.0012 29.5690 30.9596 40.0307 45.3359 45.4429 51.3508 54.8493 55.5513 59.4106 74.7164 367.5341 885.3075 electronvolt
chargesum: 1.0000000
charge: 0.134027 0.126032 -0.175267 0.134154 0.181931 0.208455 0.182242 0.208427
charge: 0.289321 0.024346 -0.043966 0.289701 0.100636 0.119577 0.100894 0.119491
qa: 0.1340 0.1260 -0.1753 0.1342 0.1819 0.2085 0.1822 0.2084
va: 3.1688 3.5677 1.2427 3.1704 0.9499 0.9406 0.9498 0.9406
dispersion: -0.003448530 hartree
energy: -821.614313660216 hartree
dipole: 0.21558 -0.16012 0.05547 0.21061 -0.15873 0.05188 -3.25877 2.44838 -0.81038
magnitude: 0.81394 au
magnitude: 2.06886 debye
