program: Orca
programVersion: 5.0.4
elementType: P C F F P H H H H
charge: 0
multiplicity: 1
keywords: SP DSD-BLYP D3BJ def2-QZVPP def2-QZVPP/C def2/J TightSCF
formula: CH4F2P2
InChI: InChI=1/CH4F2P2/c2-1(3,4)5/h4-5H2
9 atoms
P  1.596682 -0.624719 0.400774
C  -0.003897 0.277271 0.01757
F  0.279524 1.153261 -0.986805
F  -0.308267 1.011764 1.125006
P  -1.580274 -0.611721 -0.479717
H  1.574947 -1.458914 -0.740577
H  1.017111 -1.609666 1.232774
H  -0.975066 -1.466925 -1.428737
H  -1.533011 -1.580959 0.548173
totalener: -921.88465608 hartree
nucrepener: 307.97469200 hartree
electener: -1229.85934808 hartree
oneelecener: -1889.81348327 hartree
twoeener: 659.95413519 hartree
kineticenergy: 920.91925522 hartree
exchangeener: -22.359318307000 hartree
correlationener: -1.200224768208 hartree
xcener: -23.559543075208 hartree
chargesum: 0.0000000
charge: 0.100050 0.341136 -0.273652 -0.274119 0.100172 0.001664 0.001555 0.001565 0.001627
charge: 0.578977 -1.189910 0.319111 0.317909 0.579154 -0.151161 -0.151443 -0.151385 -0.151252
qa: 0.1001 0.3411 -0.2737 -0.2741 0.1002 0.0017 0.0016 0.0016 0.0016
va: 2.9625 3.8335 0.9812 0.9803 2.9629 1.0012 1.0013 1.0013 1.0014
total: -922.403638911 hartree
dispersion: -0.006553993 hartree
energy: -922.410192904262 hartree
dipole: 0.09076 -0.07649 0.01427 -6.63954 5.53530 -1.10423 -0.42187 0.35035 -0.07152
magnitude: 1.10664 au
magnitude: 2.81285 debye
