program: Orca
programVersion: 5.0.4
elementType: P C P O H H H H
charge: 0
multiplicity: 1
keywords: SP DSD-BLYP D3BJ def2-QZVPP def2-QZVPP/C def2/J TightSCF
formula: CH4OP2
InChI: InChI=1/CH4OP2/c2-1(3)4/h3-4H2
8 atoms
P  -1.626682 -0.367391 0.01337
C  0.110397 0.167943 -0.44942
P  1.394728 0.060433 0.912133
O  0.340835 0.716571 -1.488102
H  -1.981729 -0.818379 -1.274033
H  -1.286189 -1.645139 0.510789
H  1.180757 -1.296442 1.241438
H  2.489336 -0.182927 0.057834
totalener: -797.58472358 hartree
nucrepener: 199.43551019 hartree
electener: -997.02023377 hartree
oneelecener: -1497.75235303 hartree
twoeener: 500.73211926 hartree
kineticenergy: 796.77213261 hartree
exchangeener: -18.640766741440 hartree
correlationener: -0.983307231108 hartree
xcener: -19.624073972548 hartree
chargesum: -0.0000000
charge: 0.052911 0.136513 0.051469 -0.326865 0.034847 0.008030 0.008168 0.034926
charge: 0.566667 -0.835087 0.566856 0.306331 -0.147296 -0.155141 -0.155067 -0.147263
qa: 0.0529 0.1365 0.0515 -0.3269 0.0348 0.0080 0.0082 0.0349
va: 3.0048 3.9005 3.0060 2.0615 1.0105 0.9957 0.9958 1.0104
total: -797.959170921 hartree
dispersion: -0.006336113 hartree
energy: -797.965507034140 hartree
dipole: 0.58960 -0.62166 -0.03206 -3.41425 2.58026 -0.83399 -0.34607 0.85795 0.51188
magnitude: 0.97908 au
magnitude: 2.48862 debye
