program: Orca
programVersion: 5.0.4
elementType: P C P H H H H
charge: 2
multiplicity: 1
keywords: SP DSD-BLYP D3BJ def2-QZVPP def2-QZVPP/C def2/J TightSCF
formula: CH4P2
InChI: InChI=1/CH4P2/c2-1-3/h2-3H2
7 atoms
P  1.590513 0.082611 0.202507
C  0.000108 -0.000372 -0.00069
P  -1.590538 -0.082467 -0.202264
H  2.429293 -0.691255 -0.614479
H  2.112354 0.927945 1.194004
H  -2.215689 0.79761 -1.099264
H  -2.326468 -1.034298 0.520475
totalener: -721.67549378 hartree
nucrepener: 132.55513302 hartree
electener: -854.23062680 hartree
oneelecener: -1241.80915431 hartree
twoeener: 387.57852752 hartree
kineticenergy: 720.95920677 hartree
exchangeener: -15.912211444964 hartree
correlationener: -0.792357964717 hartree
xcener: -16.704569409681 hartree
chargesum: 2.0000000
charge: 0.579121 -0.080558 0.578472 0.229948 0.231318 0.231085 0.230613
charge: 1.233294 -0.324992 1.233268 -0.035411 -0.035375 -0.035382 -0.035402
qa: 0.5791 -0.0806 0.5785 0.2299 0.2313 0.2311 0.2306
va: 3.8554 3.8572 3.8557 0.9488 0.9482 0.9484 0.9485
total: -721.907755665 hartree
dispersion: -0.004988520 hartree
energy: -721.912744184617 hartree
dipole: -0.00046 0.00044 -0.00001 -0.00013 0.00024 0.00011 0.00047 0.00015 0.00062
magnitude: 0.00063 au
magnitude: 0.00161 debye
