program: Orca
programVersion: 5.0.4
elementType: F C F P C C P C C H H H H H H H H H H H H
charge: 0
multiplicity: 1
keywords: SP DSD-BLYP D3BJ def2-QZVPP def2-QZVPP/C def2/J TightSCF
formula: C5H12F2P2
InChI: InChI=1/C5H12F2P2/c1-8(2)5(6,7)9(3)4/h1-4H3
21 atoms
F  0.534721 -0.942638 1.267752
C  0.049199 0.023997 0.429355
F  -0.245793 1.090833 1.235303
P  1.32347 0.621444 -0.809578
C  2.677508 1.063201 0.363777
C  1.930649 -1.007392 -1.427985
P  -1.464331 -0.68815 -0.415772
C  -2.217156 0.879864 -1.034018
C  -2.510699 -1.006921 1.070908
H  2.930285 0.252346 1.045782
H  2.398337 1.94103 0.943646
H  3.565669 1.321647 -0.212321
H  2.769255 -0.832926 -2.102077
H  2.257084 -1.672833 -0.629667
H  1.14803 -1.504114 -2.000287
H  -1.565973 1.335665 -1.77911
H  -2.40409 1.605383 -0.243081
H  -3.162479 0.646259 -1.523322
H  -2.103984 -1.838948 1.642537
H  -3.506945 -1.295643 0.736649
H  -2.602402 -0.138276 1.721897
totalener: -1078.66145035 hartree
nucrepener: 709.96550564 hartree
electener: -1788.62695599 hartree
oneelecener: -2901.68157702 hartree
twoeener: 1113.05462103 hartree
kineticenergy: 1077.22437659 hartree
exchangeener: -29.697574601080 hartree
correlationener: -1.760641625052 hartree
xcener: -31.458216226132 hartree
chargesum: 0.0000000
charge: -0.302179 0.381076 -0.302180 0.179873 -0.297683 -0.273655 0.177835 -0.275206 -0.294176 0.088025 0.091583 0.074550 0.071553 0.086110 0.091306 0.093204 0.085575 0.071098 0.092974 0.071859 0.088460
charge: 0.316571 -1.086485 0.315939 0.514810 0.105337 0.099899 0.515497 0.100624 0.105417 -0.081527 -0.080163 -0.082210 -0.082834 -0.082073 -0.084692 -0.084552 -0.082062 -0.083559 -0.080527 -0.081986 -0.081422
qa: -0.3022 0.3811 -0.3022 0.1799 -0.2977 -0.2737 0.1778 -0.2752 -0.2942 0.0880 0.0916 0.0745 0.0716 0.0861 0.0913 0.0932 0.0856 0.0711 0.0930 0.0719 0.0885
va: 0.9478 3.7157 0.9485 3.0384 3.8650 3.8501 3.0381 3.8515 3.8621 0.9940 1.0040 1.0044 1.0053 0.9970 1.0112 1.0106 0.9962 1.0058 1.0033 1.0040 0.9943
total: -1079.551855615 hartree
dispersion: -0.016563237 hartree
energy: -1079.568418851768 hartree
dipole: -0.40191 0.37063 -0.03128 -0.24696 0.22435 -0.02261 -3.47527 3.22888 -0.24638
magnitude: 0.24939 au
magnitude: 0.63389 debye
