program: Orca
programVersion: 5.0.4
elementType: O C P C C P C C H H H H H H H H H H H H
charge: 0
multiplicity: 1
keywords: Freq RIJCOSX PBEh-3c
frequency: 0.00 0.00 0.00 0.00 0.00 0.00 53.38 59.22 134.86 153.25 162.31 169.76 181.76 191.05 210.78 235.27 256.70 262.77 304.66 398.01 510.57 634.55 694.60 697.95 745.49 749.97 843.31 877.11 888.33 935.37 954.99 956.91 978.06 1013.93 1018.96 1380.00 1384.68 1398.47 1400.48 1509.08 1509.59 1517.28 1518.00 1522.10 1525.67 1528.67 1531.15 1819.00 3123.06 3123.30 3128.29 3128.93 3216.80 3217.23 3220.93 3221.68 3221.79 3223.24 3234.87 3235.40
frequency: 53.38 59.22 134.86 153.25 162.31 169.76 181.76 191.05 210.78 235.27 256.70 262.77 304.66 398.01 510.57 634.55 694.60 697.95 745.49 749.97 843.31 877.11 888.33 935.37 954.99 956.91 978.06 1013.93 1018.96 1380.00 1384.68 1398.47 1400.48 1509.08 1509.59 1517.28 1518.00 1522.10 1525.67 1528.67 1531.15 1819.00 3123.06 3123.30 3128.29 3128.93 3216.80 3217.23 3220.93 3221.68 3221.79 3223.24 3234.87 3235.40
formula: C5H12OP2
InChI: InChI=1/C5H12OP2/c1-7(2)5(6)8(3)4/h1-4H3
20 atoms
O  0.154994 1.86516 0.592442
C  0.061393 0.722264 0.222698
P  -1.370691 -0.353824 0.747324
C  -2.604063 0.963808 1.10675
C  -1.933209 -0.944753 -0.915292
P  1.346862 -0.046631 -0.891996
C  1.705529 -1.586318 0.074451
C  2.785755 1.01016 -0.442695
H  -3.565433 0.500556 1.32645
H  -2.729307 1.668072 0.284807
H  -2.293377 1.518217 1.990118
H  -2.871829 -1.484844 -0.792001
H  -1.212869 -1.641645 -1.342254
H  -2.089497 -0.134485 -1.626796
H  2.57252 -2.07837 -0.366604
H  1.9128 -1.393151 1.126436
H  0.871239 -2.283861 0.011925
H  2.617111 2.024021 -0.800342
H  2.964313 1.048696 0.631406
H  3.67776 0.626728 -0.937027
totalener: -954.31082911 hartree
nucrepener: 554.38922550 hartree
electener: -1508.70005461 hartree
oneelecener: -2415.03382053 hartree
twoeener: 906.33376592 hartree
kineticenergy: 951.10276262 hartree
exchangeener: -46.770310023809 hartree
correlationener: -3.667344170140 hartree
xcener: -50.437654193949 hartree
energy: -2115.3865 -2115.3855 -530.6067 -286.6847 -284.2493 -284.2466 -284.0276 -284.0238 -185.3926 -185.3923 -133.4420 -133.4419 -133.4354 -133.4351 -133.3810 -133.3806 -31.6329 -23.2049 -22.8050 -21.2796 -21.2215 -19.3302 -17.2764 -14.9963 -14.0284 -13.8807 -13.4951 -13.4067 -12.7478 -12.6898 -12.5808 -12.5526 -12.1831 -12.1010 -11.7436 -10.6803 -10.5817 -8.6625 -7.6816 -6.9530 -0.2407 1.7162 2.0187 2.5313 3.4548 3.4710 4.3609 4.4983 4.6956 4.7921 5.1407 5.3382 5.7881 5.9358 5.9977 6.3656 6.4488 6.8956 7.3899 9.0883 10.6542 11.2076 11.8955 12.3572 12.5204 13.0734 13.4162 13.7344 13.9480 15.0408 15.4372 15.8698 17.4477 17.4624 17.9501 18.0429 18.5503 18.5795 18.7736 18.8893 19.3289 19.7658 20.4827 20.6418 21.7844 22.7148 22.8586 23.8022 26.3658 26.4877 26.6176 26.8854 27.1690 27.5718 27.6903 28.0575 28.2214 28.6166 28.6319 28.8891 28.9903 29.4099 29.5361 30.2655 30.8149 31.3047 31.9932 31.9993 33.3383 35.6628 36.8514 38.0378 38.4451 44.2044 45.3430 47.6074 47.8662 47.9932 48.0799 49.2652 50.2447 50.6591 51.0235 51.1590 53.0546 57.3370 57.5146 58.4281 59.0084 60.9775 61.1735 61.7131 62.6280 63.0259 63.1536 63.4337 63.8088 63.8510 64.1396 64.2154 66.9901 71.8694 75.2972 81.0004 373.2131 373.6531 374.2840 374.7543 376.6176 698.1710 electronvolt
chargesum: 0.0000000
charge: -0.332717 -0.006882 0.368321 -0.850360 -0.861192 0.368406 -0.862010 -0.850611 0.240142 0.250341 0.264867 0.250977 0.253278 0.253500 0.251229 0.253803 0.252969 0.265562 0.249925 0.240452
charge: -0.196448 -0.134470 0.346430 -0.516233 -0.520492 0.346136 -0.521018 -0.516072 0.139804 0.139332 0.152255 0.143084 0.142995 0.138572 0.143153 0.138687 0.142775 0.152537 0.139126 0.139847
qa: -0.3327 -0.0069 0.3683 -0.8504 -0.8612 0.3684 -0.8620 -0.8506 0.2401 0.2503 0.2649 0.2510 0.2533 0.2535 0.2512 0.2538 0.2530 0.2656 0.2499 0.2405
va: 2.1904 3.7572 2.9711 3.7142 3.7034 2.9704 3.7036 3.7138 0.9039 0.8993 0.8980 0.8981 0.9009 0.8948 0.8982 0.8948 0.9008 0.8979 0.8992 0.9038
dispersion: -0.011749891 hartree
energy: -954.303080478405 hartree
dipole: -0.22635 0.17318 -0.05317 -2.26742 1.67236 -0.59505 -0.64454 0.46081 -0.18373
magnitude: 0.62504 au
magnitude: 1.58872 debye
temp: 298.15 k
press: 1.00 atm
zeropoint: 0.16656498 hartree
thermalvibcorrection: 0.00934202 hartree
thermalrotcorrection: 0.00141627 hartree
thermaltrasncorrection: 0.00141627 hartree
thermaltotal: -954.12434093 hartree
thermalcorr: 0.01217457 hartree
nonthermalcorr: 0.16656498 hartree
totalcorr: 0.17873955 hartree
thermalcorrenthalpy: 0.00094421 hartree
totalenthalpy: -954.12339672 hartree
vibrat: 0.01659732 hartree
rotat: 0.01406683 hartree
transl: 0.01944642 hartree
total: 0.05011056 hartree
totalentropycorr: -0.05011056 hartree
gibbsenthalpy: -954.17350728 hartree
gibbsminuselec: 0.12957320 hartree
