program: Orca
programVersion: 5.0.4
elementType: O C P C C P C C H H H H H H H H H H H H
charge: 0
multiplicity: 1
keywords: Opt RIJCOSX PBEh-3c
formula: C5H12OP2
InChI: InChI=1/C5H12OP2/c1-7(2)5(6)8(3)4/h1-4H3
20 atoms
O  0.154994 1.86516 0.592442
C  0.061393 0.722264 0.222698
P  -1.370691 -0.353824 0.747324
C  -2.604063 0.963808 1.10675
C  -1.933209 -0.944753 -0.915292
P  1.346862 -0.046631 -0.891996
C  1.705529 -1.586318 0.074451
C  2.785755 1.01016 -0.442695
H  -3.565433 0.500556 1.326451
H  -2.729307 1.668072 0.284807
H  -2.293377 1.518217 1.990118
H  -2.871829 -1.484844 -0.792001
H  -1.212869 -1.641645 -1.342254
H  -2.089497 -0.134485 -1.626796
H  2.57252 -2.07837 -0.366604
H  1.9128 -1.393151 1.126436
H  0.871239 -2.283861 0.011925
H  2.617111 2.024021 -0.800342
H  2.964313 1.048696 0.631406
H  3.67776 0.626728 -0.937027
totalener: -954.31081773 hartree
nucrepener: 554.26185840 hartree
electener: -1508.57267614 hartree
oneelecener: -2414.78094364 hartree
twoeener: 906.20826751 hartree
kineticenergy: 951.10120954 hartree
exchangeener: -46.770024038834 hartree
correlationener: -3.667272397786 hartree
xcener: -50.437296436621 hartree
dispersion: -0.011743700 hartree
dispersion: -0.011759488 hartree
dispersion: -0.011762529 hartree
dispersion: -0.011722053 hartree
dispersion: -0.011752046 hartree
dispersion: -0.011748911 hartree
energy: -2115.3857 -2115.3852 -530.6064 -286.6850 -284.2488 -284.2466 -284.0284 -284.0241 -185.3921 -185.3919 -133.4416 -133.4412 -133.4349 -133.4346 -133.3804 -133.3802 -31.6328 -23.2048 -22.8049 -21.2796 -21.2215 -19.3301 -17.2764 -14.9962 -14.0283 -13.8806 -13.4951 -13.4066 -12.7478 -12.6897 -12.5807 -12.5526 -12.1831 -12.1009 -11.7435 -10.6802 -10.5816 -8.6624 -7.6815 -6.9528 -0.2406 1.7163 2.0188 2.5314 3.4548 3.4711 4.3610 4.4983 4.6956 4.7921 5.1407 5.3382 5.7881 5.9358 5.9977 6.3656 6.4488 6.8957 7.3900 9.0883 10.6543 11.2077 11.8955 12.3572 12.5205 13.0734 13.4162 13.7345 13.9481 15.0409 15.4373 15.8698 17.4477 17.4625 17.9503 18.0431 18.5503 18.5795 18.7737 18.8894 19.3291 19.7659 20.4828 20.6420 21.7846 22.7148 22.8588 23.8023 26.3659 26.4878 26.6176 26.8854 27.1690 27.5718 27.6903 28.0575 28.2215 28.6166 28.6319 28.8890 28.9903 29.4099 29.5361 30.2655 30.8150 31.3047 31.9934 31.9994 33.3384 35.6628 36.8514 38.0378 38.4452 44.2045 45.3431 47.6074 47.8662 47.9932 48.0799 49.2653 50.2446 50.6591 51.0235 51.1590 53.0547 57.3371 57.5148 58.4282 59.0085 60.9774 61.1735 61.7132 62.6280 63.0259 63.1537 63.4337 63.8087 63.8509 64.1396 64.2154 66.9902 71.8695 75.2973 81.0005 373.2130 373.6528 374.2839 374.7543 376.6174 698.1712 electronvolt
chargesum: -0.0000000
charge: -0.332730 -0.006851 0.368291 -0.850333 -0.861210 0.368328 -0.861995 -0.850558 0.240147 0.250329 0.264867 0.250992 0.253288 0.253501 0.251234 0.253805 0.252974 0.265555 0.249916 0.240450
charge: -0.196456 -0.134448 0.346415 -0.516216 -0.520508 0.346083 -0.521007 -0.516033 0.139807 0.139324 0.152254 0.143094 0.143002 0.138572 0.143156 0.138688 0.142778 0.152532 0.139119 0.139844
qa: -0.3327 -0.0069 0.3683 -0.8503 -0.8612 0.3683 -0.8620 -0.8506 0.2401 0.2503 0.2649 0.2510 0.2533 0.2535 0.2512 0.2538 0.2530 0.2656 0.2499 0.2404
va: 2.1904 3.7572 2.9711 3.7142 3.7034 2.9705 3.7036 3.7138 0.9039 0.8993 0.8980 0.8981 0.9009 0.8948 0.8982 0.8948 0.9008 0.8979 0.8992 0.9038
dispersion: -0.011749891 hartree
energy: -954.303080465570 hartree
dipole: -0.22635 0.17319 -0.05317 -2.26742 1.67228 -0.59514 -0.64454 0.46093 -0.18361
magnitude: 0.62508 au
magnitude: 1.58884 debye
