program: Orca
programVersion: 5.0.4
elementType: C F P C C C C H H H H H H H H H H H
charge: 1
multiplicity: 1
keywords: Freq RIJCOSX PBEh-3c
frequency: 0.00 0.00 0.00 0.00 0.00 0.00 34.25 64.39 90.84 143.13 147.15 238.52 255.63 277.32 304.86 382.29 467.47 614.52 739.75 771.68 798.05 869.25 989.34 1009.47 1027.17 1061.27 1070.44 1090.47 1113.88 1279.79 1294.95 1303.72 1329.25 1338.00 1473.22 1475.71 1483.38 1495.28 1499.32 1541.96 1547.66 1548.99 1550.38 3126.97 3135.75 3138.62 3139.12 3183.25 3195.17 3228.66 3230.22 3232.99 3235.53 3271.37
frequency: 34.25 64.39 90.84 143.13 147.15 238.52 255.63 277.32 304.86 382.29 467.47 614.52 739.75 771.68 798.05 869.25 989.34 1009.47 1027.17 1061.27 1070.44 1090.47 1113.88 1279.79 1294.95 1303.72 1329.25 1338.00 1473.22 1475.71 1483.38 1495.28 1499.32 1541.96 1547.66 1548.99 1550.38 3126.97 3135.75 3138.62 3139.12 3183.25 3195.17 3228.66 3230.22 3232.99 3235.53 3271.37
formula: C5H11FP
InChI: InChI=1/C5H11FP/c1-3-7(4-2)5-6/h5H,3-4H2,1-2H3
18 atoms
C  0.025119 2.058119 0.484527
F  -0.959446 2.811542 0.899835
P  -0.129914 0.420371 0.356867
C  -1.697703 -0.391667 0.762925
C  -2.15569 -1.347501 -0.339292
C  1.300878 -0.520826 -0.23618
C  2.515292 0.352044 -0.536115
H  0.940657 2.58555 0.238364
H  -2.421315 0.407578 0.934695
H  -1.561455 -0.913539 1.712481
H  -3.10535 -1.788706 -0.042488
H  -2.31066 -0.837091 -1.287842
H  -1.456169 -2.167961 -0.491532
H  1.524653 -1.26664 0.530258
H  0.974335 -1.062499 -1.126853
H  3.323389 -0.288877 -0.882468
H  2.87553 0.874737 0.348376
H  2.317548 1.075365 -1.325559
totalener: -637.03759100 hartree
nucrepener: 388.23571099 hartree
electener: -1025.27330199 hartree
oneelecener: -1632.88202984 hartree
twoeener: 607.60872785 hartree
kineticenergy: 634.35644995 hartree
exchangeener: -34.778156820079 hartree
correlationener: -2.882589262653 hartree
xcener: -37.660746082732 hartree
energy: -2122.1967 -689.0093 -292.8543 -290.0841 -289.9770 -288.6276 -288.4991 -192.2727 -140.3358 -140.3127 -140.2935 -42.6699 -29.8053 -28.4324 -27.3122 -24.9363 -24.1973 -22.7038 -21.7686 -20.2266 -20.0590 -19.3033 -18.9597 -18.5637 -17.6584 -17.0989 -16.8959 -16.2295 -16.0479 -15.8632 -15.4470 -13.5069 -6.1199 -3.7217 -3.3668 -2.4656 -0.6264 -0.0856 0.1879 0.4523 0.7229 0.9345 1.1227 1.5844 1.9398 2.2080 2.3115 2.4504 2.9044 4.3138 4.6887 7.7997 8.0897 8.2134 8.5152 8.9894 9.1103 9.7102 10.3407 10.6806 11.1594 11.8468 12.3668 12.8540 13.2791 14.6492 15.8492 16.3412 16.5823 16.7809 17.6892 18.6131 19.7330 21.0554 21.6274 22.1976 22.5211 22.6537 23.5950 23.8519 24.1274 24.3432 24.6203 24.9667 25.3838 25.4506 27.3158 27.6928 28.3289 28.9914 29.9402 30.2728 30.4280 31.0032 35.0342 36.4113 38.4298 39.0895 39.9427 40.0393 41.9592 46.0752 46.8161 48.7351 49.0093 49.5145 49.8871 50.3103 50.8725 53.1597 56.1865 56.9213 57.8883 58.3153 58.5420 58.9850 60.3499 60.7431 60.9844 61.4830 63.6840 66.2060 66.7663 77.2868 365.5763 367.5494 370.1657 373.9722 374.7269 887.9597 electronvolt
chargesum: 1.0000000
charge: 0.067632 -0.218671 0.610017 -0.667858 -0.664511 -0.667533 -0.675630 0.291678 0.328311 0.323853 0.302382 0.263074 0.248594 0.319802 0.319649 0.306659 0.256586 0.255966
charge: -0.008809 -0.090157 0.733013 -0.365319 -0.365736 -0.364879 -0.366130 0.171674 0.184969 0.180424 0.170363 0.150671 0.144129 0.179192 0.178439 0.172346 0.147998 0.147812
qa: 0.0676 -0.2187 0.6100 -0.6679 -0.6645 -0.6675 -0.6756 0.2917 0.3283 0.3239 0.3024 0.2631 0.2486 0.3198 0.3196 0.3067 0.2566 0.2560
va: 3.7455 1.1946 3.8258 3.6431 3.6347 3.6595 3.6429 0.8749 0.8569 0.8546 0.8818 0.8939 0.8989 0.8539 0.8548 0.8796 0.8961 0.8963
dispersion: -0.008794085 hartree
energy: -637.022715804299 hartree
dipole: 3.53205 -3.05061 0.48144 -10.70330 9.89379 -0.80951 -4.45056 4.29322 -0.15734
magnitude: 0.95491 au
magnitude: 2.42718 debye
temp: 298.15 k
press: 1.00 atm
zeropoint: 0.15682992 hartree
thermalvibcorrection: 0.00693719 hartree
thermalrotcorrection: 0.00141627 hartree
thermaltrasncorrection: 0.00141627 hartree
thermaltotal: -636.85611615 hartree
thermalcorr: 0.00976973 hartree
nonthermalcorr: 0.15682992 hartree
totalcorr: 0.16659965 hartree
thermalcorrenthalpy: 0.00094421 hartree
totalenthalpy: -636.85517194 hartree
vibrat: 0.01249452 hartree
rotat: 0.01371034 hartree
transl: 0.01914256 hartree
total: 0.04534741 hartree
totalentropycorr: -0.04534741 hartree
gibbsenthalpy: -636.90051936 hartree
gibbsminuselec: 0.12219645 hartree
