program: Orca
programVersion: 5.0.4
elementType: C F F P C C C C H H H H H H H H H H H
charge: 0
multiplicity: 1
keywords: Freq RIJCOSX PBEh-3c
frequency: 0.00 0.00 0.00 0.00 0.00 0.00 52.42 77.34 94.08 137.58 167.09 181.78 246.66 252.26 303.11 319.15 382.10 397.97 562.59 666.33 701.90 756.79 785.66 825.91 1024.15 1028.07 1046.43 1057.19 1092.12 1112.43 1159.06 1164.69 1310.46 1317.49 1334.13 1334.80 1380.00 1413.73 1468.52 1470.65 1512.99 1517.57 1551.13 1552.65 1558.15 1559.68 3088.79 3102.01 3107.68 3121.52 3127.06 3157.39 3173.42 3202.26 3204.81 3207.50 3223.10
frequency: 52.42 77.34 94.08 137.58 167.09 181.78 246.66 252.26 303.11 319.15 382.10 397.97 562.59 666.33 701.90 756.79 785.66 825.91 1024.15 1028.07 1046.43 1057.19 1092.12 1112.43 1159.06 1164.69 1310.46 1317.49 1334.13 1334.80 1380.00 1413.73 1468.52 1470.65 1512.99 1517.57 1551.13 1552.65 1558.15 1559.68 3088.79 3102.01 3107.68 3121.52 3127.06 3157.39 3173.42 3202.26 3204.81 3207.50 3223.10
formula: C5H11F2P
InChI: InChI=1/C5H11F2P/c1-3-8(4-2)5(6)7/h5H,3-4H2,1-2H3
19 atoms
C  -0.208555 2.05852 0.277309
F  0.741362 2.83446 0.860751
F  -1.421615 2.506335 0.693103
P  0.042438 0.290319 0.821305
C  1.690452 0.046283 -0.00133
C  2.211984 -1.375156 0.174673
C  -1.065361 -0.536374 -0.420851
C  -2.533595 -0.543594 -0.010639
H  -0.148115 2.20472 -0.807754
H  2.386436 0.749797 0.459235
H  1.637662 0.302364 -1.063966
H  2.285903 -1.643253 1.228609
H  1.569479 -2.111136 -0.309401
H  3.204663 -1.478225 -0.263509
H  -0.709464 -1.565991 -0.508063
H  -0.938917 -0.088265 -1.4117
H  -3.131098 -1.103927 -0.730095
H  -2.66766 -1.009122 0.965583
H  -2.945901 0.461945 0.04664
totalener: -737.00576746 hartree
nucrepener: 495.89380359 hartree
electener: -1232.89957105 hartree
oneelecener: -2000.82303279 hartree
twoeener: 767.92346174 hartree
kineticenergy: 733.77597824 hartree
exchangeener: -40.583798030859 hartree
correlationener: -3.357961253387 hartree
xcener: -43.941759284245 hartree
energy: -2115.3324 -683.0777 -683.0757 -288.4231 -284.4635 -284.4349 -284.0742 -283.9042 -185.3484 -133.3970 -133.3859 -133.3286 -37.4131 -35.7847 -24.1231 -23.2222 -21.6294 -19.8062 -19.0173 -17.4312 -16.8120 -16.5829 -15.1521 -14.1587 -13.9494 -13.6826 -13.4136 -13.0510 -12.6837 -12.1578 -11.8744 -11.8265 -11.3331 -11.0564 -9.9091 -9.6899 -7.7589 1.7598 2.0100 3.2882 3.7689 4.3090 4.4488 5.0191 5.1057 5.3564 5.6424 6.0660 6.1069 6.2258 6.6022 7.0111 7.0729 7.2701 7.7968 10.8209 12.0479 12.3537 13.0328 13.6780 13.8170 14.1917 14.4156 14.9611 15.5286 16.4098 16.6706 17.2589 17.6923 18.9514 19.4335 20.0463 21.4846 21.8394 22.1592 22.3530 22.8038 24.4356 26.2296 27.0417 27.2563 27.6490 27.9524 28.0294 28.0557 28.5135 28.8554 29.1173 29.4221 29.9984 30.8708 31.2984 32.0938 32.3094 32.7910 33.6409 33.9928 34.6441 35.1344 35.5402 35.8805 36.3671 37.1421 37.7887 38.2905 40.8548 41.3830 43.4974 43.8065 45.3963 45.4891 47.0231 49.4124 52.8629 53.4335 53.8233 54.4466 54.7632 55.1364 55.8229 56.0853 59.4908 59.9818 61.6998 62.2551 63.0836 63.8848 64.4547 64.6861 65.2747 65.5257 65.9147 66.0892 68.0933 71.4964 72.5754 81.7823 83.6556 371.4522 372.0734 378.6593 379.5982 380.8956 890.9963 895.8841 electronvolt
chargesum: -0.0000000
charge: 0.386121 -0.333133 -0.330279 0.364061 -0.648153 -0.648111 -0.653697 -0.641657 0.163579 0.261942 0.230601 0.232466 0.215601 0.234145 0.245833 0.231679 0.225565 0.229223 0.234215
charge: 0.135212 -0.194167 -0.192263 0.367076 -0.391280 -0.370386 -0.389842 -0.372622 0.092717 0.144224 0.125044 0.133592 0.123458 0.132766 0.136389 0.124647 0.129189 0.132976 0.133270
qa: 0.3861 -0.3331 -0.3303 0.3641 -0.6482 -0.6481 -0.6537 -0.6417 0.1636 0.2619 0.2306 0.2325 0.2156 0.2341 0.2458 0.2317 0.2256 0.2292 0.2342
va: 3.7231 1.0468 1.0525 2.9185 3.7034 3.7199 3.7078 3.7094 0.9095 0.8903 0.8984 0.9067 0.9128 0.9070 0.8961 0.8992 0.9092 0.9086 0.9130
dispersion: -0.009600945 hartree
energy: -736.981133215424 hartree
dipole: 1.63806 -1.39805 0.24000 -15.61765 14.90009 -0.71756 -7.27255 6.37464 -0.89791
magnitude: 1.17419 au
magnitude: 2.98456 debye
temp: 298.15 k
press: 1.00 atm
zeropoint: 0.16082116 hartree
thermalvibcorrection: 0.00762369 hartree
thermalrotcorrection: 0.00141627 hartree
thermaltrasncorrection: 0.00141627 hartree
thermaltotal: -736.80985581 hartree
thermalcorr: 0.01045624 hartree
nonthermalcorr: 0.16082116 hartree
totalcorr: 0.17127740 hartree
thermalcorrenthalpy: 0.00094421 hartree
totalenthalpy: -736.80891160 hartree
vibrat: 0.01351659 hartree
rotat: 0.01397991 hartree
transl: 0.01934892 hartree
total: 0.04684542 hartree
totalentropycorr: -0.04684542 hartree
gibbsenthalpy: -736.85575702 hartree
gibbsminuselec: 0.12537619 hartree
