program: Orca
programVersion: 5.0.4
elementType: C P C C C C O H H H H H H H H H H H
charge: 0
multiplicity: 1
keywords: SP DSD-BLYP D3BJ def2-QZVPP def2-QZVPP/C def2/J TightSCF
formula: C5H11OP
InChI: InChI=1/C5H11OP/c1-3-7(4-2)5-6/h5H,3-4H2,1-2H3
18 atoms
C  -0.005535 1.534131 -0.14969
P  -0.075123 -0.011512 0.853848
C  -0.836556 -1.184447 -0.358398
C  -2.357839 -1.081078 -0.349487
C  1.738316 -0.416322 0.811912
C  2.365912 -0.637809 -0.55707
O  -0.739392 1.810381 -1.059665
H  0.763525 2.256378 0.205701
H  -0.525517 -2.190164 -0.063944
H  -0.449602 -1.009325 -1.363734
H  -2.685998 -0.093408 -0.667924
H  -2.796312 -1.809886 -1.031613
H  -2.765333 -1.267428 0.644226
H  1.879047 -1.295521 1.444209
H  2.242988 0.398437 1.339111
H  2.246131 0.229566 -1.207315
H  3.435302 -0.832853 -0.465107
H  1.925223 -1.492414 -1.069488
totalener: -612.66409588 hartree
nucrepener: 382.77910969 hartree
electener: -995.44320557 hartree
oneelecener: -1599.64031407 hartree
twoeener: 604.19710851 hartree
kineticenergy: 611.66684199 hartree
exchangeener: -18.848001393968 hartree
correlationener: -1.197131956579 hartree
xcener: -20.045133350547 hartree
chargesum: 0.0000000
charge: 0.113808 0.168312 -0.099165 -0.195056 -0.159546 -0.149920 -0.358313 0.091691 0.042103 0.048140 0.088831 0.051454 0.065870 0.058891 0.053814 0.063331 0.060971 0.054784
charge: -0.449857 0.571465 -0.031148 0.199760 -0.043685 0.206315 0.310961 -0.098407 -0.070846 -0.070377 -0.061726 -0.066957 -0.067054 -0.070884 -0.068007 -0.061984 -0.063864 -0.063706
qa: 0.1138 0.1683 -0.0992 -0.1951 -0.1595 -0.1499 -0.3583 0.0917 0.0421 0.0481 0.0888 0.0515 0.0659 0.0589 0.0538 0.0633 0.0610 0.0548
va: 3.9571 3.0520 3.8093 3.9007 3.8442 3.8730 2.0646 0.9740 1.0012 1.0029 0.9988 0.9968 0.9974 1.0008 1.0058 0.9971 0.9993 0.9981
total: -613.324067579 hartree
dispersion: -0.011845650 hartree
energy: -613.335913229025 hartree
dipole: 3.12345 -2.26574 0.85772 -6.63007 5.89745 -0.73262 -2.87625 3.20508 0.32883
magnitude: 1.17496 au
magnitude: 2.98652 debye
