program: Orca
programVersion: 5.0.4
elementType: C P C C C C H H H H H H H H H H H
charge: 2
multiplicity: 1
keywords: Freq RIJCOSX PBEh-3c
frequency: 0.00 0.00 0.00 0.00 0.00 0.00 38.91 53.72 99.88 111.30 130.39 230.52 258.79 284.22 306.54 337.96 446.92 612.12 747.68 769.88 878.25 908.51 938.30 1019.30 1039.19 1065.63 1088.77 1158.20 1260.79 1270.39 1275.35 1296.31 1424.54 1426.10 1450.30 1458.76 1465.19 1469.63 1525.61 1528.36 3058.69 3062.71 3113.30 3114.82 3187.32 3187.57 3214.47 3217.24 3249.27 3249.93 3302.61
frequency: 38.91 53.72 99.88 111.30 130.39 230.52 258.79 284.22 306.54 337.96 446.92 612.12 747.68 769.88 878.25 908.51 938.30 1019.30 1039.19 1065.63 1088.77 1158.20 1260.79 1270.39 1275.35 1296.31 1424.54 1426.10 1450.30 1458.76 1465.19 1469.63 1525.61 1528.36 3058.69 3062.71 3113.30 3114.82 3187.32 3187.57 3214.47 3217.24 3249.27 3249.93 3302.61
formula: C5H11P
InChI: InChI=1/C5H11P/c1-4-6(3)5-2/h3H,4-5H2,1-2H3
17 atoms
C  0.143697 2.552253 -0.155287
P  0.061638 0.964467 -0.066768
C  1.417894 -0.042509 -0.982765
C  2.055754 -0.994456 0.000372
C  -1.382781 0.23128 0.972806
C  -2.17367 -0.711597 0.100538
H  0.191878 3.636981 -0.216944
H  0.831893 -0.511966 -1.781167
H  2.093291 0.702385 -1.406544
H  2.792884 -1.5454 -0.601849
H  1.374548 -1.736092 0.412383
H  2.616719 -0.502267 0.792472
H  -1.939971 1.092402 1.344704
H  -0.827392 -0.236449 1.794048
H  -2.705783 -0.220196 -0.711538
H  -2.943477 -1.115172 0.774677
H  -1.607023 -1.563763 -0.269041
totalener: -536.77096996 hartree
nucrepener: 293.66281615 hartree
electener: -830.43378611 hartree
oneelecener: -1294.90143129 hartree
twoeener: 464.46764518 hartree
kineticenergy: 534.70897729 hartree
exchangeener: -28.902796045778 hartree
correlationener: -2.392636489385 hartree
xcener: -31.295432535163 hartree
energy: -2128.7743 -299.0127 -296.0412 -296.0277 -293.2620 -293.2576 -198.7910 -146.8524 -146.8355 -146.7794 -35.4037 -33.6247 -33.1298 -29.5342 -29.1314 -27.7807 -25.3989 -24.4238 -23.9820 -23.3741 -22.5495 -22.1952 -20.9619 -20.9386 -20.6437 -20.6108 -20.3181 -15.2727 -12.4220 -10.2455 -8.1006 -6.2237 -5.7762 -5.0403 -4.6622 -4.2932 -3.8959 -3.6536 -3.5140 -3.2873 -2.8323 -2.2929 -1.8024 -1.4532 -1.2781 -0.2970 2.2470 2.9505 3.0647 3.5525 3.6246 4.7517 4.8640 5.3391 5.3578 6.0218 6.3999 7.3369 7.7797 8.6722 9.4608 9.6596 9.8611 10.9525 11.1109 12.1956 12.2573 13.7112 15.2826 16.9520 17.8446 17.8462 18.6707 18.9125 19.4157 19.4276 19.9755 20.1978 20.2453 21.5670 21.7593 22.7598 24.3485 29.3652 30.0317 32.0112 32.6357 34.5217 35.3745 35.5081 37.3651 40.0172 40.9373 42.8856 43.0367 43.4913 44.1035 44.8771 46.1553 51.5775 51.9502 52.4577 52.8065 54.9198 55.3116 57.2641 57.4354 60.9029 61.2833 61.3011 356.5205 361.2707 361.2818 368.7992 369.5713 electronvolt
chargesum: 2.0000000
charge: -0.041912 0.741935 -0.615606 -0.691353 -0.614133 -0.690249 0.411633 0.385239 0.383427 0.377232 0.288534 0.315748 0.383617 0.383699 0.316804 0.376756 0.288630
charge: 0.109100 0.859929 -0.251712 -0.362748 -0.249320 -0.362309 0.260613 0.213221 0.210736 0.225087 0.167871 0.181388 0.210436 0.212594 0.182028 0.225114 0.167972
qa: -0.0419 0.7419 -0.6156 -0.6914 -0.6141 -0.6902 0.4116 0.3852 0.3834 0.3772 0.2885 0.3157 0.3836 0.3837 0.3168 0.3768 0.2886
va: 3.1082 3.6856 3.4514 3.5385 3.4521 3.5385 0.8253 0.8136 0.8210 0.8381 0.8836 0.8696 0.8209 0.8145 0.8692 0.8382 0.8836
dispersion: -0.008016699 hartree
energy: -536.761273835707 hartree
dipole: -0.40230 0.47116 0.06886 -6.45674 7.65065 1.19390 0.43277 -0.50158 -0.06881
magnitude: 1.19787 au
magnitude: 3.04473 debye
temp: 298.15 k
press: 1.00 atm
zeropoint: 0.14656420 hartree
thermalvibcorrection: 0.00702260 hartree
thermalrotcorrection: 0.00141627 hartree
thermaltrasncorrection: 0.00141627 hartree
thermaltotal: -536.60485450 hartree
thermalcorr: 0.00985514 hartree
nonthermalcorr: 0.14656420 hartree
totalcorr: 0.15641934 hartree
thermalcorrenthalpy: 0.00094421 hartree
totalenthalpy: -536.60391029 hartree
vibrat: 0.01275315 hartree
rotat: 0.01324389 hartree
transl: 0.01890091 hartree
total: 0.04489794 hartree
totalentropycorr: -0.04489794 hartree
gibbsenthalpy: -536.64880823 hartree
gibbsminuselec: 0.11246560 hartree
