program: Orca
programVersion: 5.0.4
elementType: C P C C C C H H H H H H H H H H H
charge: 2
multiplicity: 1
keywords: Opt RIJCOSX PBEh-3c
formula: C5H11P
InChI: InChI=1/C5H11P/c1-4-6(3)5-2/h3H,4-5H2,1-2H3
17 atoms
C  0.143697 2.552253 -0.155287
P  0.061638 0.964466 -0.066768
C  1.417894 -0.042509 -0.982765
C  2.055754 -0.994456 0.000372
C  -1.382781 0.23128 0.972806
C  -2.17367 -0.711597 0.100538
H  0.191878 3.636981 -0.216944
H  0.831893 -0.511966 -1.781167
H  2.093291 0.702385 -1.406544
H  2.792884 -1.5454 -0.601849
H  1.374548 -1.736092 0.412383
H  2.616719 -0.502268 0.792472
H  -1.939971 1.092402 1.344704
H  -0.827392 -0.236449 1.794048
H  -2.705783 -0.220196 -0.711538
H  -2.943477 -1.115172 0.774677
H  -1.607023 -1.563763 -0.269041
totalener: -536.76936830 hartree
nucrepener: 288.81073276 hartree
electener: -825.58010106 hartree
oneelecener: -1285.45895891 hartree
twoeener: 459.87885785 hartree
kineticenergy: 534.73355818 hartree
exchangeener: -28.897908391913 hartree
correlationener: -2.390636098332 hartree
xcener: -31.288544490245 hartree
dispersion: -0.007753722 hartree
dispersion: -0.007750209 hartree
dispersion: -0.007754608 hartree
dispersion: -0.007762565 hartree
dispersion: -0.007775372 hartree
dispersion: -0.007791246 hartree
dispersion: -0.007812013 hartree
dispersion: -0.007840021 hartree
dispersion: -0.007876970 hartree
dispersion: -0.007921436 hartree
dispersion: -0.007924610 hartree
dispersion: -0.007923156 hartree
dispersion: -0.007951124 hartree
dispersion: -0.008019578 hartree
dispersion: -0.008013590 hartree
energy: -2128.7819 -299.0104 -296.0353 -296.0217 -293.2563 -293.2522 -198.7971 -146.8587 -146.8418 -146.7856 -35.4040 -33.6224 -33.1287 -29.5331 -29.1299 -27.7799 -25.3983 -24.4224 -23.9806 -23.3729 -22.5477 -22.1928 -20.9604 -20.9375 -20.6423 -20.6102 -20.3178 -15.2722 -12.4229 -10.2452 -8.1013 -6.2237 -5.7763 -5.0400 -4.6614 -4.2925 -3.8949 -3.6527 -3.5130 -3.2866 -2.8314 -2.2920 -1.8016 -1.4521 -1.2773 -0.2970 2.2475 2.9509 3.0644 3.5525 3.6249 4.7519 4.8653 5.3398 5.3588 6.0227 6.4006 7.3361 7.7802 8.6730 9.4610 9.6617 9.8614 10.9520 11.1112 12.1955 12.2580 13.7109 15.2823 16.9532 17.8458 17.8472 18.6718 18.9140 19.4162 19.4288 19.9769 20.1992 20.2466 21.5682 21.7591 22.7607 24.3495 29.3660 30.0326 32.0136 32.6380 34.5238 35.3750 35.5086 37.3672 40.0174 40.9380 42.8880 43.0391 43.4939 44.1061 44.8793 46.1573 51.5799 51.9525 52.4601 52.8088 54.9221 55.3139 57.2665 57.4378 60.9043 61.2858 61.3030 356.5224 361.2756 361.2868 368.8042 369.5762 electronvolt
chargesum: 2.0000000
charge: -0.042153 0.742667 -0.615915 -0.691652 -0.614431 -0.690532 0.411630 0.385284 0.383489 0.377294 0.288635 0.315840 0.383673 0.383739 0.316893 0.376809 0.288728
charge: 0.108916 0.860491 -0.251970 -0.362934 -0.249574 -0.362484 0.260621 0.213251 0.210782 0.225133 0.167939 0.181449 0.210480 0.212621 0.182087 0.225154 0.168038
qa: -0.0422 0.7427 -0.6159 -0.6917 -0.6144 -0.6905 0.4116 0.3853 0.3835 0.3773 0.2886 0.3158 0.3837 0.3837 0.3169 0.3768 0.2887
va: 3.1081 3.6857 3.4515 3.5384 3.4522 3.5384 0.8253 0.8136 0.8210 0.8380 0.8836 0.8696 0.8209 0.8145 0.8692 0.8381 0.8835
dispersion: -0.008016699 hartree
energy: -536.761274084214 hartree
dipole: -0.40230 0.47117 0.06888 -6.45674 7.65076 1.19401 0.43277 -0.50163 -0.06886
magnitude: 1.19798 au
magnitude: 3.04502 debye
