program: Orca
programVersion: 5.0.4
elementType: C C P C C C P C C C C O H H H H H H H H H H H H H H H H H H H H
charge: 0
multiplicity: 1
keywords: Freq RIJCOSX PBEh-3c
frequency: 0.00 0.00 0.00 0.00 0.00 0.00 37.45 50.21 83.81 87.18 99.88 107.70 116.42 132.57 161.25 167.86 184.65 214.94 234.08 261.74 265.81 274.24 288.97 305.63 336.68 368.62 403.24 423.82 527.00 623.66 646.24 659.92 694.54 716.89 742.17 760.00 777.02 790.80 899.35 1018.03 1020.64 1022.48 1024.81 1036.51 1051.74 1059.64 1078.08 1088.68 1095.16 1107.30 1113.99 1304.03 1310.72 1314.13 1319.42 1329.45 1330.64 1338.79 1344.53 1464.06 1465.17 1466.86 1467.78 1507.44 1510.83 1511.20 1514.60 1544.41 1546.06 1549.58 1553.14 1556.33 1557.28 1558.78 1561.24 1809.36 3117.01 3117.99 3118.44 3119.21 3121.32 3122.52 3123.50 3139.64 3164.48 3166.08 3179.19 3184.79 3196.17 3197.87 3200.36 3201.84 3204.12 3209.80 3213.80 3221.47
frequency: 37.45 50.21 83.81 87.18 99.88 107.70 116.42 132.57 161.25 167.86 184.65 214.94 234.08 261.74 265.81 274.24 288.97 305.63 336.68 368.62 403.24 423.82 527.00 623.66 646.24 659.92 694.54 716.89 742.17 760.00 777.02 790.80 899.35 1018.03 1020.64 1022.48 1024.81 1036.51 1051.74 1059.64 1078.08 1088.68 1095.16 1107.30 1113.99 1304.03 1310.72 1314.13 1319.42 1329.45 1330.64 1338.79 1344.53 1464.06 1465.17 1466.86 1467.78 1507.44 1510.83 1511.20 1514.60 1544.41 1546.06 1549.58 1553.14 1556.33 1557.28 1558.78 1561.24 1809.36 3117.01 3117.99 3118.44 3119.21 3121.32 3122.52 3123.50 3139.64 3164.48 3166.08 3179.19 3184.79 3196.17 3197.87 3200.36 3201.84 3204.12 3209.80 3213.80 3221.47
formula: C9H20OP2
InChI: InChI=1/C9H20OP2/c1-5-11(6-2)9(10)12(7-3)8-4/h5-8H2,1-4H3
32 atoms
C  -2.645311 -1.099346 2.529986
C  -2.837906 -0.5534 1.119595
P  -1.472398 0.600014 0.644438
C  -2.055255 1.314478 -0.973003
C  -2.56846 0.334403 -2.01721
C  -0.208546 -0.621214 0.013618
P  1.139411 0.063099 -1.077105
C  2.4466 -1.217911 -0.806183
C  3.794677 -0.757722 -1.34797
C  1.717737 1.489706 -0.031482
C  2.182428 1.170167 1.380512
O  -0.257923 -1.794355 0.290332
H  -2.566542 -0.295293 3.26191
H  -1.743243 -1.704946 2.597212
H  -3.4870 -1.730279 2.817101
H  -2.92276 -1.371977 0.403432
H  -3.765788 0.022848 1.06522
H  -2.82857 2.043761 -0.717952
H  -1.227199 1.9003 -1.380028
H  -1.791451 -0.366027 -2.322105
H  -2.899314 0.865361 -2.910962
H  -3.41648 -0.242591 -1.64988
H  2.116802 -2.115757 -1.33091
H  2.520855 -1.488401 0.248222
H  4.175203 0.109121 -0.8060
H  3.734544 -0.486269 -2.402497
H  4.53839 -1.549027 -1.252546
H  2.514343 1.980349 -0.596321
H  0.898933 2.213012 -0.003309
H  3.025208 0.478822 1.386309
H  2.506636 2.078139 1.891049
H  1.382676 0.730837 1.976526
totalener: -1111.23041082 hartree
nucrepener: 991.10941394 hartree
electener: -2102.33982475 hartree
oneelecener: -3495.83931786 hartree
twoeener: 1393.49949311 hartree
kineticenergy: 1106.63034233 hartree
exchangeener: -59.907211626539 hartree
correlationener: -5.036672765166 hartree
xcener: -64.943884391705 hartree
energy: -2115.2193 -2115.2108 -530.5457 -286.6255 -284.4223 -284.4040 -284.1935 -284.1776 -283.9445 -283.8477 -283.8370 -283.6597 -185.2157 -185.2035 -133.2671 -133.2580 -133.2538 -133.2466 -133.2063 -133.1944 -31.5421 -24.0119 -23.7992 -23.0215 -23.0013 -20.7204 -20.0125 -19.0924 -18.9096 -18.4816 -16.7657 -15.0197 -14.4360 -14.2687 -14.0961 -13.8363 -13.6854 -13.1824 -12.9208 -12.8135 -12.4314 -12.2623 -12.1172 -11.7096 -11.6586 -11.4710 -11.4517 -11.0913 -11.0509 -10.9858 -10.7512 -9.8186 -9.7101 -8.3304 -7.4521 -6.8995 -0.2189 1.6734 1.9880 2.4373 3.2196 3.4046 4.0565 4.4058 4.5765 4.6832 4.9377 5.0548 5.1547 5.3255 5.4777 5.5310 5.6137 5.8573 5.9205 6.0718 6.1859 6.2303 6.4237 6.6401 6.6647 6.9885 7.1139 7.2000 7.5957 7.6963 8.1981 9.1697 11.2731 11.3411 12.2904 12.6633 12.8088 13.2498 13.5251 13.8055 14.1432 14.3144 14.5677 14.9095 15.1700 15.2407 15.6724 15.8489 16.1406 16.2858 16.5842 17.0552 17.7018 17.9425 18.3675 18.6091 18.8641 19.5442 20.2466 20.3379 20.9322 21.1785 21.7121 21.9774 22.0747 22.3677 22.5760 22.9961 23.4855 23.8880 24.4655 24.8939 26.0862 26.5106 26.8656 27.0705 27.1793 27.5535 27.6337 27.7177 27.9626 28.2849 28.4069 28.5452 28.7444 29.0422 29.0850 29.2138 29.4793 29.6438 29.7980 30.0794 30.1847 30.3774 30.9183 31.3287 31.4839 31.9794 32.5659 33.2589 33.8747 34.3690 35.5618 35.9331 36.8967 39.5033 40.7496 41.2686 41.3392 43.3827 43.6399 43.7585 43.9255 44.3411 44.9328 45.8503 46.1420 46.7147 47.5362 49.6934 52.6847 53.6661 54.2453 54.5246 54.5549 54.7764 54.9588 55.1998 55.2235 55.5613 55.6238 56.3881 56.7007 57.5704 58.9209 60.4580 61.9917 62.6054 63.1044 63.4361 64.7600 64.9301 65.0246 65.3764 65.5337 65.7058 65.8358 65.8895 65.9438 66.1141 66.2728 66.3859 67.3091 71.3122 71.4644 72.1432 72.5392 72.7562 75.6801 81.4245 371.8104 372.0340 372.6360 372.7268 376.8440 379.4141 379.5711 379.9147 380.1333 698.7775 electronvolt
chargesum: -0.0000000
charge: -0.644540 -0.639939 0.380703 -0.657548 -0.632496 -0.014672 0.382053 -0.634789 -0.656939 -0.667546 -0.633835 -0.335609 0.218547 0.242681 0.224181 0.258760 0.234572 0.248706 0.253776 0.235925 0.227942 0.221201 0.261986 0.252743 0.217221 0.227007 0.235003 0.250536 0.259235 0.218891 0.228974 0.237269
charge: -0.371242 -0.384333 0.349627 -0.390959 -0.371061 -0.133871 0.351066 -0.383141 -0.371948 -0.393532 -0.371258 -0.200495 0.126987 0.137392 0.128164 0.139147 0.133567 0.137798 0.138996 0.133723 0.130686 0.126771 0.145919 0.136187 0.123958 0.130574 0.132704 0.137559 0.140705 0.125135 0.131472 0.133702
qa: -0.6445 -0.6399 0.3807 -0.6575 -0.6325 -0.0147 0.3821 -0.6348 -0.6569 -0.6675 -0.6338 -0.3356 0.2185 0.2427 0.2242 0.2588 0.2346 0.2487 0.2538 0.2359 0.2279 0.2212 0.2620 0.2527 0.2172 0.2270 0.2350 0.2505 0.2592 0.2189 0.2290 0.2373
va: 3.7111 3.7240 2.9423 3.7279 3.6990 3.7813 2.9502 3.7216 3.7185 3.7209 3.6983 2.1882 0.9115 0.9091 0.9109 0.8921 0.8986 0.8920 0.8937 0.9082 0.9090 0.9097 0.8897 0.8930 0.9107 0.9082 0.9069 0.8920 0.8917 0.9105 0.9091 0.9084
dispersion: -0.021077945 hartree
energy: -1111.211659660462 hartree
dipole: 2.31021 -2.24840 0.06181 0.91219 -0.33326 0.57893 1.47789 -1.61521 -0.13732
magnitude: 0.59820 au
magnitude: 1.52049 debye
temp: 298.15 k
press: 1.00 atm
zeropoint: 0.28526483 hartree
thermalvibcorrection: 0.01422616 hartree
thermalrotcorrection: 0.00141627 hartree
thermaltrasncorrection: 0.00141627 hartree
thermaltotal: -1110.90933613 hartree
thermalcorr: 0.01705870 hartree
nonthermalcorr: 0.28526483 hartree
totalcorr: 0.30232353 hartree
thermalcorrenthalpy: 0.00094421 hartree
totalenthalpy: -1110.90839192 hartree
vibrat: 0.02554362 hartree
rotat: 0.01513919 hartree
transl: 0.01989621 hartree
total: 0.06057901 hartree
totalentropycorr: -0.06057901 hartree
gibbsenthalpy: -1110.96897093 hartree
gibbsminuselec: 0.24268873 hartree
