program: Orca
programVersion: 5.0.4
elementType: C C P C C C P C C C C H H H H H H H H H H H H H H H H H H H H
charge: 2
multiplicity: 1
keywords: Opt RIJCOSX PBEh-3c
formula: C9H20P2
InChI: InChI=1/C9H20P2/c1-5-10(6-2)9-11(7-3)8-4/h5-8H2,1-4H3
31 atoms
C  -2.045105 -2.232413 1.031135
C  -2.717296 -1.054873 0.339215
P  -1.567331 0.183669 -0.294586
C  -2.22423 1.547547 -1.28107
C  -3.446215 2.197178 -0.622322
C  0.000206 0.063533 0.020934
P  1.566835 -0.069132 0.335678
C  2.295184 0.694679 1.802418
C  3.568523 1.481326 1.469539
C  2.644541 -0.987179 -0.783915
C  1.923558 -1.644345 -1.952795
H  -1.491595 -1.925648 1.916117
H  -2.821198 -2.922721 1.356962
H  -1.383117 -2.77867 0.362516
H  -3.318499 -1.364122 -0.523977
H  -3.399904 -0.519407 1.009556
H  -1.407534 2.253973 -1.437552
H  -2.482272 1.121095 -2.257072
H  -3.217284 2.626524 0.350835
H  -4.28442 1.509875 -0.524453
H  -3.776629 3.009737 -1.267784
H  1.523754 1.319964 2.254856
H  2.507162 -0.123221 2.500197
H  3.93841 1.918739 2.39559
H  3.385057 2.297397 0.773678
H  4.362142 0.847292 1.078573
H  3.405205 -0.273245 -1.120755
H  3.16981 -1.715286 -0.15419
H  1.193512 -2.38108 -1.624326
H  2.663018 -2.166711 -2.557267
H  1.435813 -0.914577 -2.595735
totalener: -1035.45446085 hartree
nucrepener: 829.15201419 hartree
electener: -1864.60647504 hartree
oneelecener: -3034.68594531 hartree
twoeener: 1170.07947027 hartree
kineticenergy: 1031.35564443 hartree
exchangeener: -55.000674538741 hartree
correlationener: -4.575636641928 hartree
xcener: -59.576311180670 hartree
dispersion: -0.017805694 hartree
dispersion: -0.017804605 hartree
dispersion: -0.017816474 hartree
dispersion: -0.017815089 hartree
dispersion: -0.017811316 hartree
energy: -2126.3487 -2126.3454 -294.1965 -293.0225 -293.0220 -292.9896 -292.9894 -291.2221 -291.2190 -291.2059 -291.2037 -196.2705 -196.2679 -144.3699 -144.3689 -144.3100 -144.3085 -144.2714 -144.2706 -33.3503 -32.6615 -31.2908 -31.2854 -30.5991 -28.6816 -27.4364 -27.0470 -26.9680 -26.0969 -23.2906 -22.4298 -22.3961 -22.1975 -21.8814 -21.8460 -21.6619 -21.4880 -19.9864 -19.9797 -19.7962 -19.7920 -19.1520 -19.0327 -18.9691 -18.7789 -18.7491 -18.6977 -18.4317 -18.3888 -17.4624 -17.4063 -10.4482 -10.4217 -7.2521 -6.4276 -5.4308 -4.8064 -4.2219 -3.5497 -3.5120 -3.2777 -3.0412 -2.9154 -2.3597 -2.3103 -2.1259 -2.0876 -1.8545 -1.6998 -1.5732 -1.3245 -1.2931 -1.0503 -1.0103 -0.5619 -0.5099 -0.4130 -0.2370 -0.0941 0.1381 0.2747 0.3788 0.7556 0.9048 2.4582 4.8078 4.8591 4.9491 5.0430 5.0506 5.5345 5.5641 5.9970 6.4085 6.8261 6.9185 7.4223 7.4523 7.6268 8.0248 8.4575 8.6384 8.9297 9.0425 9.5129 9.5832 10.0277 10.6243 10.6484 11.7270 12.1503 12.8264 12.9344 13.4542 13.6284 13.8623 13.9381 14.1136 14.3050 15.2896 15.3588 15.9591 16.3239 17.3197 17.5207 17.8787 18.7386 19.3771 19.5741 19.6816 19.9287 20.1923 20.6965 20.8431 21.0699 21.0974 21.2135 21.2650 21.8248 21.8580 22.0210 22.1968 22.2785 22.4783 22.7391 22.8246 22.9611 23.7137 25.3092 25.5356 26.1451 26.5064 26.8495 32.0607 32.3739 33.6719 33.8627 35.5513 35.6765 36.0509 36.4364 37.1375 37.4816 39.2101 39.3014 39.6971 39.7127 45.3531 45.4505 45.9635 46.1556 46.1957 46.3326 46.5645 46.6850 46.9398 47.0297 47.9936 48.3132 48.7795 49.2269 53.8548 54.1361 55.3220 55.5206 55.5871 55.7195 55.8735 55.9425 57.5984 57.8004 58.0369 58.1852 58.2939 58.3030 58.5148 58.5688 63.0858 63.2874 63.5137 64.0151 66.6220 361.7272 363.5909 364.7493 364.7799 365.3097 370.9610 371.0750 371.7759 371.9859 electronvolt
chargesum: 2.0000000
charge: -0.652052 -0.691317 0.767344 -0.682556 -0.673774 -0.302823 0.767752 -0.681993 -0.673522 -0.691967 -0.651824 0.255788 0.327321 0.253988 0.343667 0.349366 0.336331 0.347777 0.271532 0.266861 0.331152 0.335946 0.347907 0.331156 0.271305 0.266484 0.347938 0.344910 0.253909 0.327208 0.256188
charge: -0.359563 -0.364459 0.915625 -0.361363 -0.363528 -0.460312 0.915641 -0.361347 -0.363260 -0.364731 -0.359487 0.150435 0.185069 0.149056 0.196386 0.198622 0.189569 0.197095 0.155721 0.154158 0.187358 0.189523 0.197095 0.187309 0.155599 0.153977 0.197877 0.197149 0.149052 0.185111 0.150620
qa: -0.6521 -0.6913 0.7673 -0.6826 -0.6738 -0.3028 0.7678 -0.6820 -0.6735 -0.6920 -0.6518 0.2558 0.3273 0.2540 0.3437 0.3494 0.3363 0.3478 0.2715 0.2669 0.3312 0.3359 0.3479 0.3312 0.2713 0.2665 0.3479 0.3449 0.2539 0.3272 0.2562
va: 3.6252 3.6290 3.9115 3.6213 3.5986 3.7164 3.9123 3.6209 3.5991 3.6288 3.6251 0.8975 0.8689 0.8986 0.8416 0.8396 0.8516 0.8401 0.8897 0.8920 0.8677 0.8518 0.8401 0.8678 0.8897 0.8922 0.8403 0.8410 0.8987 0.8689 0.8973
dispersion: -0.017812541 hartree
energy: -1035.437085352627 hartree
dipole: 0.00392 -0.00205 0.00187 -0.64190 0.77561 0.13371 -0.22960 0.26870 0.03910
magnitude: 0.13932 au
magnitude: 0.35413 debye
