program: Orca
programVersion: 5.0.4
elementType: C C P C C C P C C C C H H H H H H H H H H H H H H H H H H H H
charge: 2
multiplicity: 1
keywords: SP DSD-BLYP D3BJ def2-QZVPP def2-QZVPP/C def2/J TightSCF
formula: C9H20P2
InChI: InChI=1/C9H20P2/c1-5-10(6-2)9-11(7-3)8-4/h5-8H2,1-4H3
31 atoms
C  -2.044979 -2.254244 1.023323
C  -2.71717 -1.076704 0.331403
P  -1.567205 0.161839 -0.302399
C  -2.224104 1.525717 -1.288883
C  -3.446089 2.175347 -0.630134
C  0.000332 0.041702 0.013122
P  1.56696 -0.090963 0.327865
C  2.29531 0.672848 1.794606
C  3.568649 1.459496 1.461726
C  2.644667 -1.00901 -0.791727
C  1.923684 -1.666176 -1.960607
H  -1.491469 -1.947479 1.908305
H  -2.821072 -2.944552 1.34915
H  -1.382992 -2.800501 0.354704
H  -3.318373 -1.385953 -0.53179
H  -3.399779 -0.541237 1.001743
H  -1.407408 2.232142 -1.445365
H  -2.482146 1.099265 -2.264885
H  -3.217158 2.604693 0.343022
H  -4.284294 1.488044 -0.532265
H  -3.776503 2.987906 -1.275596
H  1.52388 1.298134 2.247043
H  2.507288 -0.145052 2.492384
H  3.938536 1.896908 2.387778
H  3.385183 2.275566 0.765866
H  4.362268 0.825462 1.07076
H  3.405331 -0.295076 -1.128568
H  3.169936 -1.737117 -0.162002
H  1.193638 -2.40291 -1.632139
H  2.663143 -2.188541 -2.565079
H  1.435939 -0.936407 -2.603547
totalener: -1035.36516319 hartree
nucrepener: 829.37920340 hartree
electener: -1864.74436658 hartree
oneelecener: -3035.99207646 hartree
twoeener: 1171.24770988 hartree
kineticenergy: 1033.76173163 hartree
exchangeener: -30.588388889927 hartree
correlationener: -1.910351674327 hartree
xcener: -32.498740564253 hartree
chargesum: 2.0000000
charge: -0.115690 -0.113850 0.567031 -0.122622 -0.134004 -0.250568 0.564808 -0.119041 -0.133939 -0.115189 -0.111943 0.069859 0.125008 0.070646 0.118724 0.120609 0.129995 0.119439 0.087550 0.081423 0.120119 0.125936 0.121302 0.120206 0.087910 0.080774 0.123193 0.120339 0.071631 0.121753 0.068592
charge: 0.259783 0.058018 0.873730 0.062188 0.265264 -0.294702 0.873756 0.062490 0.265414 0.057957 0.260178 -0.051125 -0.030591 -0.052178 -0.024186 -0.025399 -0.031867 -0.027705 -0.049372 -0.049400 -0.029839 -0.031803 -0.027937 -0.030020 -0.049415 -0.049515 -0.025769 -0.023992 -0.052336 -0.030624 -0.051003
qa: -0.1157 -0.1139 0.5670 -0.1226 -0.1340 -0.2506 0.5648 -0.1190 -0.1339 -0.1152 -0.1119 0.0699 0.1250 0.0706 0.1187 0.1206 0.1300 0.1194 0.0875 0.0814 0.1201 0.1259 0.1213 0.1202 0.0879 0.0808 0.1232 0.1203 0.0716 0.1218 0.0686
va: 3.8655 3.8753 4.1085 3.8481 3.8791 3.8007 4.1089 3.8500 3.8815 3.8733 3.8655 0.9929 1.0008 0.9955 0.9821 0.9841 0.9846 0.9860 0.9923 0.9981 0.9980 0.9853 0.9859 0.9986 0.9927 0.9981 0.9836 0.9821 0.9954 1.0027 0.9930
total: -1036.333848362 hartree
dispersion: -0.022630593 hartree
energy: -1036.356478954608 hartree
dipole: 0.00392 -0.00167 0.00226 -0.64190 0.76474 0.12284 -0.22960 0.26618 0.03657
magnitude: 0.12819 au
magnitude: 0.32584 debye
