program: Orca
programVersion: 5.0.4
elementType: C C F C H H H H H H
charge: 1
multiplicity: 1
keywords: Opt RIJCOSX PBEh-3c
formula: C3H6F
InChI: InChI=1/C3H6F/c1-3(2)4/h1-2H3
10 atoms
C  -1.29827 0.054748 0.024301
C  0.079732 0.494482 -0.034819
F  0.279876 1.745674 -0.125357
C  1.251017 -0.355327 -0.002399
H  -1.984922 0.740441 -0.471531
H  -1.57096 0.051333 1.094138
H  -1.414997 -0.970661 -0.322576
H  1.054124 -1.301428 0.499485
H  1.471736 -0.607169 -1.05449
H  2.132563 0.148106 0.393248
totalener: -217.01436036 hartree
nucrepener: 126.84730029 hartree
electener: -343.86166064 hartree
oneelecener: -538.89457807 hartree
twoeener: 195.03291743 hartree
kineticenergy: 215.55951130 hartree
exchangeener: -15.306646858462 hartree
correlationener: -1.394245452941 hartree
xcener: -16.700892311403 hartree
dispersion: -0.003098324 hartree
dispersion: -0.003097955 hartree
dispersion: -0.003096711 hartree
dispersion: -0.003096983 hartree
dispersion: -0.003099776 hartree
dispersion: -0.003106858 hartree
dispersion: -0.003120027 hartree
dispersion: -0.003120848 hartree
dispersion: -0.003118312 hartree
dispersion: -0.003119237 hartree
dispersion: -0.003119704 hartree
energy: -691.6770 -296.2020 -290.6404 -290.6386 -45.7089 -31.6316 -28.9595 -26.0021 -23.1010 -22.9998 -22.3253 -19.5619 -19.3991 -18.8772 -18.7585 -18.4968 -8.3954 -2.0013 -1.3928 -0.9801 -0.2951 -0.0136 0.1801 0.8523 2.3682 2.4865 7.0783 7.3457 8.4712 9.2218 9.5329 9.9589 10.5633 11.3324 11.8635 16.3231 19.6125 21.2418 21.7584 21.9808 22.0278 22.6766 23.6720 25.7031 26.2350 26.6052 27.5206 28.2702 31.8428 32.1095 33.4925 38.9821 39.9151 42.8712 45.2759 48.0660 48.8146 50.8159 51.6548 54.2419 54.3299 56.4753 59.5656 60.0931 61.3215 68.9149 73.0509 74.5007 361.0810 370.8454 377.5342 885.5026 electronvolt
chargesum: 1.0000000
charge: -0.812321 0.684894 -0.130269 -0.812880 0.350863 0.355128 0.329122 0.329754 0.354946 0.350762
charge: -0.364226 0.407291 0.029895 -0.364119 0.209109 0.235938 0.200457 0.201006 0.235959 0.208690
qa: -0.8123 0.6849 -0.1303 -0.8129 0.3509 0.3551 0.3291 0.3298 0.3549 0.3508
va: 3.5680 3.4209 1.3412 3.5679 0.8557 0.8448 0.8645 0.8640 0.8448 0.8559
dispersion: -0.003119735 hartree
energy: -217.004001880077 hartree
dipole: -0.96761 0.80236 -0.16525 -6.01905 4.99626 -1.02279 0.43044 -0.35687 0.07357
magnitude: 1.03866 au
magnitude: 2.64007 debye
