program: Orca
programVersion: 5.0.4
elementType: C C C O H H H H H H
charge: 0
multiplicity: 1
keywords: Opt RIJCOSX PBEh-3c
formula: C3H6O
InChI: InChI=1/C3H6O/c1-3(2)4/h1-2H3
10 atoms
C  -1.280643 -0.107834 0.040985
C  0.018526 0.571988 -0.320541
C  1.270777 -0.15878 0.103132
O  0.054639 1.625325 -0.900696
H  -1.289681 -0.402459 1.091838
H  -1.39202 -1.026363 -0.539718
H  -2.131325 0.538406 -0.161292
H  1.21614 -1.219571 -0.145882
H  1.379344 -0.098649 1.188786
H  2.154142 0.277839 -0.356613
totalener: -192.74773117 hartree
nucrepener: 119.81561337 hartree
electener: -312.56334454 hartree
oneelecener: -498.06391817 hartree
twoeener: 185.50057364 hartree
kineticenergy: 191.35253920 hartree
exchangeener: -14.447900952111 hartree
correlationener: -1.376484094722 hartree
xcener: -15.824385046833 hartree
dispersion: -0.003316882 hartree
dispersion: -0.003317066 hartree
dispersion: -0.003317406 hartree
dispersion: -0.003317859 hartree
dispersion: -0.003317969 hartree
dispersion: -0.003317878 hartree
dispersion: -0.003317706 hartree
energy: -530.1841 -286.7429 -284.1115 -284.1092 -31.4408 -23.4556 -21.6734 -16.4467 -14.3317 -14.1815 -14.0650 -12.5072 -12.3938 -11.8497 -10.9660 -8.2787 0.6674 3.7296 4.8112 5.4660 5.5546 5.7914 6.0070 6.6547 8.1500 9.8644 13.5400 14.0314 14.6611 15.2650 16.0624 17.4189 18.1394 18.9755 20.1911 22.9689 25.8222 26.3700 27.4833 27.6727 28.1622 29.1177 29.1550 30.8193 32.0272 32.8350 39.3240 39.5151 40.5582 48.3777 49.4129 50.3393 50.6123 50.9049 54.1396 55.9652 57.2812 58.4597 59.9331 61.0778 62.2292 64.4199 67.7080 69.2364 73.1059 76.5358 81.1701 84.0835 368.7469 377.5964 381.3117 698.8724 electronvolt
chargesum: 0.0000000
charge: -0.751332 0.370650 -0.751303 -0.328271 0.230719 0.239070 0.260222 0.229213 0.240588 0.260444
charge: -0.397585 0.095123 -0.397853 -0.184484 0.143139 0.149217 0.149953 0.141668 0.150508 0.150314
qa: -0.7513 0.3707 -0.7513 -0.3283 0.2307 0.2391 0.2602 0.2292 0.2406 0.2604
va: 3.6389 3.9607 3.6388 2.2304 0.9076 0.9045 0.9058 0.9084 0.9039 0.9056
dispersion: -0.003317633 hartree
energy: -192.738421645098 hartree
dipole: -0.14752 0.11519 -0.03233 -4.48155 3.48407 -0.99748 2.49791 -1.94090 0.55701
magnitude: 1.14292 au
magnitude: 2.90508 debye
