program: Orca
programVersion: 5.0.4
elementType: C C C H H H H H H
charge: 2
multiplicity: 1
keywords: SP DSD-BLYP D3BJ def2-QZVPP def2-QZVPP/C def2/J TightSCF
formula: C3H6
InChI: InChI=1/C3H6/c1-3-2/h1-2H3
9 atoms
C  -1.338475 0.015972 0.072693
C  0.000002 0.000322 -0.000029
C  1.338478 -0.016055 -0.072685
H  -1.773389 -0.926839 -0.362411
H  -1.758468 0.891798 -0.496584
H  -1.678429 0.09781 1.142941
H  1.678332 -0.096996 -1.143032
H  1.774989 0.925079 0.364252
H  1.756903 -0.8937 0.495086
totalener: -116.61222719 hartree
nucrepener: 70.67548632 hartree
electener: -187.28771351 hartree
oneelecener: -283.33340126 hartree
twoeener: 96.04568774 hartree
kineticenergy: 116.29349231 hartree
exchangeener: -5.276186437096 hartree
correlationener: -0.376716149241 hartree
xcener: -5.652902586336 hartree
chargesum: 2.0000000
charge: -0.093920 0.548717 -0.093821 0.272596 0.273118 0.273796 0.273796 0.272634 0.273084
charge: 0.427099 0.565990 0.427104 0.096561 0.096621 0.096724 0.096716 0.096476 0.096708
qa: -0.0939 0.5487 -0.0938 0.2726 0.2731 0.2738 0.2738 0.2726 0.2731
va: 3.7990 3.3712 3.7989 0.9400 0.9396 0.9390 0.9390 0.9400 0.9396
total: -116.858365398 hartree
dispersion: -0.002597510 hartree
energy: -116.860962908012 hartree
dipole: -0.00006 0.00003 -0.00003 -0.00267 0.00183 -0.00084 0.00024 -0.00014 0.00010
magnitude: 0.00085 au
magnitude: 0.00216 debye
