program: Orca
programVersion: 5.0.4
elementType: F C P C C C C C C C C C C C C P C C C C C C H H H H H H H H H H H H H H H H
charge: 1
multiplicity: 1
keywords: Freq RIJCOSX PBEh-3c
frequency: 0.00 0.00 0.00 0.00 0.00 0.00 27.36 32.72 39.14 54.15 67.10 68.24 75.64 80.87 96.87 173.53 193.30 209.00 246.83 262.09 273.22 296.84 327.57 363.62 411.54 414.39 417.38 431.66 459.82 467.24 483.23 513.44 523.66 601.37 638.75 640.01 641.53 700.67 720.43 724.00 727.65 734.65 741.42 764.58 783.48 785.60 793.38 889.83 895.81 897.20 936.39 979.25 985.74 985.86 1036.05 1037.68 1038.98 1039.32 1041.42 1042.94 1068.22 1070.93 1072.54 1080.96 1081.33 1082.87 1111.54 1143.60 1144.29 1149.28 1152.57 1159.81 1166.88 1223.37 1226.14 1226.98 1248.20 1250.27 1252.85 1320.85 1372.93 1373.72 1377.23 1404.96 1406.71 1407.97 1524.00 1525.03 1525.98 1567.01 1568.14 1570.21 1690.96 1691.60 1694.70 1701.44 1705.27 1707.73 2496.98 3264.33 3269.24 3272.46 3274.46 3277.38 3278.08 3280.78 3284.48 3286.95 3291.56 3294.67 3296.20 3299.51 3302.25 3303.63
frequency: 27.36 32.72 39.14 54.15 67.10 68.24 75.64 80.87 96.87 173.53 193.30 209.00 246.83 262.09 273.22 296.84 327.57 363.62 411.54 414.39 417.38 431.66 459.82 467.24 483.23 513.44 523.66 601.37 638.75 640.01 641.53 700.67 720.43 724.00 727.65 734.65 741.42 764.58 783.48 785.60 793.38 889.83 895.81 897.20 936.39 979.25 985.74 985.86 1036.05 1037.68 1038.98 1039.32 1041.42 1042.94 1068.22 1070.93 1072.54 1080.96 1081.33 1082.87 1111.54 1143.60 1144.29 1149.28 1152.57 1159.81 1166.88 1223.37 1226.14 1226.98 1248.20 1250.27 1252.85 1320.85 1372.93 1373.72 1377.23 1404.96 1406.71 1407.97 1524.00 1525.03 1525.98 1567.01 1568.14 1570.21 1690.96 1691.60 1694.70 1701.44 1705.27 1707.73 2496.98 3264.33 3269.24 3272.46 3274.46 3277.38 3278.08 3280.78 3284.48 3286.95 3291.56 3294.67 3296.20 3299.51 3302.25 3303.63
formula: C19H16FP2
InChI: InChI=1/C19H16FP2/c20-19(21-16-10-4-1-5-11-16)22(17-12-6-2-7-13-17)18-14-8-3-9-15-18/h1-15,21H
38 atoms
F  0.52833 2.305753 -2.474709
C  0.681963 1.21218 -1.763251
P  -0.135001 1.140954 -0.260305
C  -1.545897 2.234581 -0.15992
C  -2.818493 1.704398 0.049665
C  -3.8992 2.562996 0.155461
C  -3.712386 3.93503 0.059376
C  -2.441313 4.459089 -0.132382
C  -1.349905 3.613875 -0.231337
C  -0.45049 -0.554067 0.206787
C  -0.06785 -0.986216 1.47446
C  -0.336758 -2.289143 1.85858
C  -0.98205 -3.152176 0.984797
C  -1.365924 -2.71944 -0.277922
C  -1.104698 -1.419227 -0.673329
P  1.813868 0.005577 -2.472453
C  2.471585 -0.848002 -1.015585
C  2.260849 -2.22083 -0.923752
C  2.744805 -2.921601 0.169829
C  3.444724 -2.25579 1.164129
C  3.667812 -0.887465 1.06896
C  3.184805 -0.181423 -0.019223
H  -2.969195 0.635906 0.130838
H  -4.889459 2.158581 0.313116
H  -4.560636 4.600319 0.145702
H  -2.297523 5.528924 -0.192282
H  -0.358398 4.031612 -0.347778
H  0.445057 -0.317978 2.153498
H  -0.040348 -2.630341 2.840645
H  -1.192202 -4.168361 1.290294
H  -1.874665 -3.393757 -0.953178
H  -1.411558 -1.082033 -1.655529
H  2.830825 0.924617 -2.810545
H  1.719028 -2.743246 -1.701726
H  2.580948 -3.98804 0.239813
H  3.830407 -2.805107 2.012578
H  4.22915 -0.373601 1.837556
H  3.369692 0.883352 -0.09098
totalener: -1513.31266511 hartree
nucrepener: 2011.68474369 hartree
electener: -3524.99740880 hartree
oneelecener: -6051.41147132 hartree
twoeener: 2526.41406252 hartree
kineticenergy: 1505.92583173 hartree
exchangeener: -88.971561492620 hartree
correlationener: -7.567135691659 hartree
xcener: -96.538697184279 hartree
chargesum: 1.0000000
charge: -0.228808 0.120367 0.571325 -0.159744 -0.216139 -0.198273 -0.211527 -0.199402 -0.259372 -0.220478 -0.204230 -0.204436 -0.210931 -0.219237 -0.212781 0.292373 -0.232090 -0.222861 -0.200268 -0.220171 -0.216409 -0.210952 0.262643 0.262063 0.266294 0.263525 0.249452 0.261519 0.262422 0.266530 0.264694 0.266960 0.163253 0.254315 0.254328 0.258859 0.257186 0.250002
charge: -0.094666 -0.032738 0.652718 -0.204403 -0.113513 -0.112433 -0.087480 -0.112556 -0.114211 -0.210332 -0.098570 -0.111695 -0.089245 -0.120129 -0.123169 0.382161 -0.223371 -0.110534 -0.117600 -0.098425 -0.123373 -0.126137 0.154471 0.156607 0.157762 0.157256 0.150969 0.155132 0.156533 0.157217 0.157232 0.152553 0.078249 0.151049 0.152394 0.153347 0.153106 0.145824
qa: -0.2288 0.1204 0.5713 -0.1597 -0.2161 -0.1983 -0.2115 -0.1994 -0.2594 -0.2205 -0.2042 -0.2044 -0.2109 -0.2192 -0.2128 0.2924 -0.2321 -0.2229 -0.2003 -0.2202 -0.2164 -0.2110 0.2626 0.2621 0.2663 0.2635 0.2495 0.2615 0.2624 0.2665 0.2647 0.2670 0.1633 0.2543 0.2543 0.2589 0.2572 0.2500
va: 1.1843 3.5957 3.7021 3.7207 3.7812 3.8072 3.7867 3.8069 3.8070 3.7705 3.7871 3.8128 3.7837 3.8135 3.7655 3.1280 3.7490 3.7951 3.8132 3.7940 3.8168 3.7865 0.8939 0.8958 0.8942 0.8951 0.9064 0.9013 0.8958 0.8938 0.8952 0.8943 0.9514 0.9066 0.8994 0.8971 0.8981 0.9031
dispersion: -0.033611152 hartree
energy: -1513.297076165451 hartree
dipole: -4.13008 3.90382 -0.22626 -8.30093 8.15329 -0.14764 11.69697 -11.20553 0.49144
magnitude: 0.56081 au
magnitude: 1.42546 debye
temp: 298.15 k
press: 1.00 atm
zeropoint: 0.30216811 hartree
thermalvibcorrection: 0.01649707 hartree
thermalrotcorrection: 0.00141627 hartree
thermaltrasncorrection: 0.00141627 hartree
thermaltotal: -1512.97557844 hartree
thermalcorr: 0.01932961 hartree
nonthermalcorr: 0.30216811 hartree
totalcorr: 0.32149773 hartree
thermalcorrenthalpy: 0.00094421 hartree
totalenthalpy: -1512.97463423 hartree
vibrat: 0.02916626 hartree
rotat: 0.01641106 hartree
transl: 0.02054177 hartree
total: 0.06611910 hartree
totalentropycorr: -0.06611910 hartree
gibbsenthalpy: -1513.04075333 hartree
gibbsminuselec: 0.25632284 hartree
