program: Orca
programVersion: 5.0.4
elementType: F C P C C C C C C C C C C C C P C C C C C C C C C C C C H H H H H H H H H H H H H H H H H H H H
charge: 1
multiplicity: 1
keywords: SP DSD-BLYP D3BJ def2-QZVPP def2-QZVPP/C def2/J TightSCF
formula: C25H20FP2
InChI: InChI=1/C25H20FP2/c26-25(27(21-13-5-1-6-14-21)22-15-7-2-8-16-22)28(23-17-9-3-10-18-23)24-19-11-4-12-20-24/h1-20H
48 atoms
F  -0.139296 2.136991 0.833965
C  -0.059849 0.914541 0.370874
P  1.202419 -0.094382 1.071664
C  2.574857 1.007006 1.484526
C  2.429275 1.842935 2.590764
C  3.463787 2.689559 2.952038
C  4.650159 2.682568 2.232734
C  4.805591 1.826568 1.152016
C  3.771673 0.985566 0.772914
C  1.644154 -1.259733 -0.230597
C  1.974584 -0.834404 -1.518976
C  2.30744 -1.767753 -2.485093
C  2.310786 -3.121193 -2.172092
C  1.985356 -3.544754 -0.892759
C  1.654043 -2.616469 0.081465
P  -1.215349 0.482106 -0.878461
C  -2.718739 1.438412 -0.592168
C  -3.898678 0.831479 -0.169589
C  -5.041748 1.598475 -0.012807
C  -5.010963 2.960621 -0.275097
C  -3.838681 3.560709 -0.711621
C  -2.694123 2.801242 -0.886176
C  -1.483947 -1.287391 -0.673934
C  -1.361636 -2.106527 -1.79284
C  -1.555464 -3.473122 -1.668434
C  -1.871043 -4.019163 -0.433538
C  -1.999965 -3.202895 0.683107
C  -1.808711 -1.837039 0.567889
H  1.522115 1.829061 3.181789
H  3.348266 3.343975 3.805014
H  5.460594 3.337238 2.522993
H  5.735421 1.811404 0.600085
H  3.906839 0.314515 -0.064555
H  1.971393 0.218792 -1.771407
H  2.569941 -1.439533 -3.481765
H  2.574119 -3.847297 -2.929488
H  1.989659 -4.598507 -0.650773
H  1.393641 -2.949553 1.077689
H  -3.93678 -0.231283 0.028169
H  -5.959111 1.128464 0.31416
H  -5.906929 3.55379 -0.15247
H  -3.818652 4.618954 -0.932565
H  -1.795377 3.271368 -1.265242
H  -1.104125 -1.683198 -2.754938
H  -1.458217 -4.110788 -2.53618
H  -2.023142 -5.086041 -0.339466
H  -2.255284 -3.630912 1.643059
H  -1.910228 -1.20543 1.441775
totalener: -1743.42249828 hartree
nucrepener: 2829.04150236 hartree
electener: -4572.46400064 hartree
oneelecener: -7989.74251656 hartree
twoeener: 3417.27851593 hartree
kineticenergy: 1740.24209561 hartree
exchangeener: -59.639368263781 hartree
correlationener: -3.927730117926 hartree
xcener: -63.567098381707 hartree
chargesum: 1.0000000
charge: -0.161524 0.166084 0.215522 0.063112 -0.068832 -0.116583 -0.078588 -0.119447 -0.112511 0.143230 -0.106858 -0.137552 -0.086441 -0.132857 -0.076223 0.218053 0.067642 -0.109707 -0.122838 -0.082074 -0.113414 -0.072732 0.143840 -0.074033 -0.132192 -0.091491 -0.133134 -0.111135 0.090188 0.115439 0.114330 0.114472 0.093563 0.108062 0.118896 0.116818 0.117558 0.112728 0.094736 0.117433 0.118319 0.115579 0.090280 0.112618 0.120195 0.121285 0.119046 0.111140
charge: 0.464085 -0.597873 0.704314 -0.223280 0.057722 0.089431 0.100791 0.089382 0.065831 -0.231291 0.051279 0.085017 0.101484 0.093120 0.066808 0.709250 -0.223355 0.066693 0.089965 0.101674 0.089901 0.058889 -0.230737 0.067647 0.093602 0.102033 0.085648 0.052700 -0.051153 -0.049224 -0.046788 -0.049823 -0.051916 -0.050064 -0.049930 -0.046381 -0.049314 -0.047205 -0.051207 -0.049549 -0.046448 -0.049059 -0.050897 -0.047028 -0.049104 -0.046184 -0.049752 -0.049702
qa: -0.1615 0.1661 0.2155 0.0631 -0.0688 -0.1166 -0.0786 -0.1194 -0.1125 0.1432 -0.1069 -0.1376 -0.0864 -0.1329 -0.0762 0.2181 0.0676 -0.1097 -0.1228 -0.0821 -0.1134 -0.0727 0.1438 -0.0740 -0.1322 -0.0915 -0.1331 -0.1111 0.0902 0.1154 0.1143 0.1145 0.0936 0.1081 0.1189 0.1168 0.1176 0.1127 0.0947 0.1174 0.1183 0.1156 0.0903 0.1126 0.1202 0.1213 0.1190 0.1111
va: 1.1173 3.6291 3.3801 3.5345 3.7159 3.8214 3.8491 3.8131 3.7221 3.5691 3.7231 3.8477 3.8357 3.8171 3.7286 3.3981 3.5264 3.7178 3.8146 3.8494 3.8204 3.7201 3.5768 3.7299 3.8131 3.8348 3.8481 3.7294 0.9935 0.9825 0.9808 0.9811 1.0196 0.9864 0.9848 0.9822 0.9800 0.9857 1.0176 0.9800 0.9796 0.9821 0.9937 0.9862 0.9794 0.9807 0.9849 0.9856
total: -1745.777592317 hartree
dispersion: -0.055723609 hartree
energy: -1745.833315926497 hartree
dipole: 0.42595 -0.45714 -0.03118 -7.35025 6.84908 -0.50117 -3.06942 2.84448 -0.22495
magnitude: 0.55022 au
magnitude: 1.39855 debye
