program: Orca
programVersion: 5.0.4
elementType: F C F P C C C C C C C C C C C C P C C C C C C C C C C C C H H H H H H H H H H H H H H H H H H H H
charge: 0
multiplicity: 1
keywords: Freq RIJCOSX PBEh-3c
frequency: 0.00 0.00 0.00 0.00 0.00 0.00 14.18 17.32 27.72 38.12 43.09 46.03 57.97 72.89 88.00 96.38 99.13 105.79 158.49 204.58 212.32 224.69 229.57 239.36 251.58 270.04 273.41 286.06 321.05 402.88 416.55 416.71 424.36 425.38 436.41 441.73 451.56 476.93 485.13 516.20 518.29 534.92 542.83 627.03 644.59 645.52 645.78 645.94 718.71 719.80 732.56 733.84 737.69 737.73 739.07 741.42 786.46 787.91 789.69 794.36 894.71 896.23 901.33 903.85 921.18 970.27 971.11 985.10 988.05 1027.84 1028.62 1036.33 1037.48 1041.99 1042.31 1045.19 1045.62 1052.23 1053.36 1058.30 1058.73 1083.72 1084.34 1086.54 1086.96 1118.92 1137.02 1139.07 1144.18 1147.35 1148.71 1157.44 1159.24 1162.63 1164.55 1216.30 1216.33 1216.91 1217.02 1249.39 1250.38 1255.14 1256.51 1359.61 1360.42 1368.33 1370.22 1402.29 1403.40 1406.94 1408.36 1517.67 1517.95 1522.48 1522.87 1571.99 1572.25 1574.71 1575.14 1692.14 1692.61 1695.09 1695.69 1712.80 1713.07 1714.15 1714.35 3261.18 3261.55 3262.03 3262.29 3267.93 3268.12 3268.28 3269.28 3276.46 3277.35 3277.59 3277.72 3283.07 3283.31 3286.30 3286.69 3290.30 3290.51 3293.08 3293.89
frequency: 14.18 17.32 27.72 38.12 43.09 46.03 57.97 72.89 88.00 96.38 99.13 105.79 158.49 204.58 212.32 224.69 229.57 239.36 251.58 270.04 273.41 286.06 321.05 402.88 416.55 416.71 424.36 425.38 436.41 441.73 451.56 476.93 485.13 516.20 518.29 534.92 542.83 627.03 644.59 645.52 645.78 645.94 718.71 719.80 732.56 733.84 737.69 737.73 739.07 741.42 786.46 787.91 789.69 794.36 894.71 896.23 901.33 903.85 921.18 970.27 971.11 985.10 988.05 1027.84 1028.62 1036.33 1037.48 1041.99 1042.31 1045.19 1045.62 1052.23 1053.36 1058.30 1058.73 1083.72 1084.34 1086.54 1086.96 1118.92 1137.02 1139.07 1144.18 1147.35 1148.71 1157.44 1159.24 1162.63 1164.55 1216.30 1216.33 1216.91 1217.02 1249.39 1250.38 1255.14 1256.51 1359.61 1360.42 1368.33 1370.22 1402.29 1403.40 1406.94 1408.36 1517.67 1517.95 1522.48 1522.87 1571.99 1572.25 1574.71 1575.14 1692.14 1692.61 1695.09 1695.69 1712.80 1713.07 1714.15 1714.35 3261.18 3261.55 3262.03 3262.29 3267.93 3268.12 3268.28 3269.28 3276.46 3277.35 3277.59 3277.72 3283.07 3283.31 3286.30 3286.69 3290.30 3290.51 3293.08 3293.89
formula: C25H20F2P2
InChI: InChI=1/C25H20F2P2/c26-25(27,28(21-13-5-1-6-14-21)22-15-7-2-8-16-22)29(23-17-9-3-10-18-23)24-19-11-4-12-20-24/h1-20H
49 atoms
F  0.947827 0.463756 -1.942951
C  0.073126 0.620974 -0.904697
F  -0.678919 1.712771 -1.242278
P  0.922129 1.064736 0.72475
C  1.542319 -0.573597 1.246151
C  2.243106 -1.449107 0.414798
C  2.659217 -2.681465 0.890033
C  2.387404 -3.051814 2.200841
C  1.696677 -2.187962 3.035647
C  1.272692 -0.956318 2.557067
C  2.42439 1.896642 0.087616
C  3.703956 1.516331 0.483602
C  4.813585 2.246252 0.080911
C  4.661773 3.36233 -0.725394
C  3.389817 3.752849 -1.119327
C  2.279902 3.03382 -0.708909
P  -0.934755 -0.975441 -0.836657
C  -2.212393 -0.572558 -2.085111
C  -1.809078 -0.45245 -3.41611
C  -2.73777 -0.226285 -4.417726
C  -4.088499 -0.138445 -4.111392
C  -4.500474 -0.279824 -2.796392
C  -3.570049 -0.49297 -1.788771
C  -1.794712 -0.763835 0.762147
C  -1.778698 -1.85833 1.623208
C  -2.371407 -1.78462 2.875298
C  -2.982437 -0.608577 3.281197
C  -3.004832 0.489706 2.431603
C  -2.416516 0.414542 1.179815
H  2.46625 -1.169594 -0.606074
H  3.195082 -3.356371 0.235824
H  2.715924 -4.014993 2.569246
H  1.482263 -2.472304 4.05734
H  0.711286 -0.290758 3.201175
H  3.845897 0.647947 1.113103
H  5.800318 1.93561 0.398861
H  5.527786 3.92842 -1.04204
H  3.259129 4.624612 -1.746961
H  1.296459 3.368591 -1.012175
H  -0.763031 -0.540433 -3.680562
H  -2.40507 -0.124381 -5.44237
H  -4.814676 0.031894 -4.895237
H  -5.552063 -0.221347 -2.547461
H  -3.91477 -0.600493 -0.769035
H  -1.278813 -2.768876 1.316484
H  -2.347536 -2.642499 3.53423
H  -3.440788 -0.544874 4.259577
H  -3.477733 1.410215 2.74751
H  -2.442895 1.278624 0.529797
totalener: -1843.80269658 hartree
nucrepener: 3091.90244582 hartree
electener: -4935.70514241 hartree
oneelecener: -8680.95600462 hartree
twoeener: 3745.25086221 hartree
kineticenergy: 1833.95998552 hartree
exchangeener: -112.924316262109 hartree
correlationener: -9.793644249306 hartree
xcener: -122.717960511415 hartree
chargesum: 0.0000000
charge: -0.327742 0.370771 -0.329644 0.517228 -0.266756 -0.204299 -0.207686 -0.228529 -0.212716 -0.239946 -0.178313 -0.258117 -0.196665 -0.236777 -0.197556 -0.267246 0.516369 -0.175473 -0.266839 -0.197143 -0.236878 -0.195032 -0.256476 -0.262819 -0.240869 -0.213424 -0.228407 -0.206914 -0.214285 0.258564 0.225845 0.225139 0.222700 0.246095 0.244453 0.219839 0.220300 0.221077 0.235902 0.235045 0.221242 0.220903 0.219669 0.244582 0.245240 0.223153 0.225299 0.226114 0.261020
charge: -0.190271 0.068481 -0.192366 0.439844 -0.208209 -0.118534 -0.136439 -0.121805 -0.140354 -0.118377 -0.182087 -0.137142 -0.133021 -0.133201 -0.131487 -0.131161 0.439867 -0.181897 -0.130187 -0.131630 -0.131956 -0.132828 -0.136017 -0.207175 -0.117667 -0.140052 -0.121891 -0.136450 -0.122236 0.149204 0.139210 0.137906 0.137770 0.146544 0.145250 0.136471 0.136115 0.137243 0.142211 0.141974 0.137309 0.136335 0.136493 0.145260 0.146369 0.137963 0.138009 0.139328 0.149291
qa: -0.3277 0.3708 -0.3296 0.5172 -0.2668 -0.2043 -0.2077 -0.2285 -0.2127 -0.2399 -0.1783 -0.2581 -0.1967 -0.2368 -0.1976 -0.2672 0.5164 -0.1755 -0.2668 -0.1971 -0.2369 -0.1950 -0.2565 -0.2628 -0.2409 -0.2134 -0.2284 -0.2069 -0.2143 0.2586 0.2258 0.2251 0.2227 0.2461 0.2445 0.2198 0.2203 0.2211 0.2359 0.2350 0.2212 0.2209 0.2197 0.2446 0.2452 0.2232 0.2253 0.2261 0.2610
va: 1.0424 3.6379 1.0393 2.9090 3.7932 3.7715 3.8186 3.8160 3.8140 3.8050 3.7603 3.8125 3.8232 3.8234 3.8215 3.8222 2.9134 3.7600 3.8233 3.8196 3.8235 3.8197 3.8117 3.7911 3.8080 3.8141 3.8159 3.8177 3.7712 0.9091 0.9095 0.9096 0.9104 0.9099 0.9045 0.9109 0.9113 0.9103 0.9188 0.9172 0.9102 0.9111 0.9110 0.9038 0.9103 0.9103 0.9095 0.9095 0.9087
dispersion: -0.044326137 hartree
energy: -1843.774342439160 hartree
dipole: -0.47976 0.40758 -0.07218 -4.73353 4.26529 -0.46824 6.89128 -6.23142 0.65986
magnitude: 0.81233 au
magnitude: 2.06477 debye
temp: 298.15 k
press: 1.00 atm
zeropoint: 0.39042260 hartree
thermalvibcorrection: 0.02204392 hartree
thermalrotcorrection: 0.00141627 hartree
thermaltrasncorrection: 0.00141627 hartree
thermaltotal: -1843.35904338 hartree
thermalcorr: 0.02487647 hartree
nonthermalcorr: 0.39042260 hartree
totalcorr: 0.41529906 hartree
thermalcorrenthalpy: 0.00094421 hartree
totalenthalpy: -1843.35809917 hartree
vibrat: 0.03966360 hartree
rotat: 0.01713227 hartree
transl: 0.02090499 hartree
total: 0.07770085 hartree
totalentropycorr: -0.07770085 hartree
gibbsenthalpy: -1843.43580002 hartree
gibbsminuselec: 0.33854242 hartree
