program: Orca
programVersion: 5.0.4
elementType: F C F P C C C C C C C C C C C C P C C C C C C C C C C C C H H H H H H H H H H H H H H H H H H H H
charge: 0
multiplicity: 1
keywords: SP DSD-BLYP D3BJ def2-QZVPP def2-QZVPP/C def2/J TightSCF
formula: C25H20F2P2
InChI: InChI=1/C25H20F2P2/c26-25(27,28(21-13-5-1-6-14-21)22-15-7-2-8-16-22)29(23-17-9-3-10-18-23)24-19-11-4-12-20-24/h1-20H
49 atoms
F  0.94033 0.383734 -1.826823
C  0.065628 0.540952 -0.788569
F  -0.686416 1.632749 -1.12615
P  0.914631 0.984715 0.840878
C  1.534821 -0.653619 1.362279
C  2.235609 -1.529129 0.530926
C  2.65172 -2.761487 1.006161
C  2.379907 -3.131835 2.316969
C  1.68918 -2.267984 3.151775
C  1.265195 -1.03634 2.673196
C  2.416893 1.81662 0.203745
C  3.696459 1.43631 0.59973
C  4.806088 2.166231 0.197039
C  4.654275 3.282308 -0.609266
C  3.38232 3.672827 -1.003199
C  2.272405 2.953798 -0.592781
P  -0.942252 -1.055463 -0.720529
C  -2.21989 -0.65258 -1.968983
C  -1.816575 -0.532471 -3.299982
C  -2.745267 -0.306306 -4.301598
C  -4.095996 -0.218467 -3.995264
C  -4.507971 -0.359845 -2.680264
C  -3.577547 -0.572992 -1.672643
C  -1.802209 -0.843856 0.878275
C  -1.786195 -1.938351 1.739337
C  -2.378904 -1.864642 2.991426
C  -2.989934 -0.688599 3.397325
C  -3.012329 0.409684 2.547731
C  -2.424013 0.33452 1.295943
H  2.458753 -1.249616 -0.489946
H  3.187585 -3.436393 0.351953
H  2.708427 -4.095015 2.685374
H  1.474766 -2.552325 4.173469
H  0.703788 -0.37078 3.317303
H  3.8384 0.567925 1.229231
H  5.792821 1.855589 0.514989
H  5.520289 3.848398 -0.925912
H  3.251632 4.544591 -1.630833
H  1.288962 3.28857 -0.896046
H  -0.770528 -0.620455 -3.564434
H  -2.412568 -0.204403 -5.326242
H  -4.822173 -0.048128 -4.779109
H  -5.55956 -0.301368 -2.431333
H  -3.922267 -0.680515 -0.652907
H  -1.28631 -2.848898 1.432612
H  -2.355034 -2.722521 3.650358
H  -3.448286 -0.624896 4.375705
H  -3.48523 1.330193 2.863638
H  -2.450392 1.198602 0.645926
totalener: -1843.36140340 hartree
nucrepener: 3091.90244642 hartree
electener: -4935.26384982 hartree
oneelecener: -8681.12612666 hartree
twoeener: 3745.86227684 hartree
kineticenergy: 1840.03839283 hartree
exchangeener: -62.858784801692 hartree
correlationener: -4.133015525131 hartree
xcener: -66.991800326823 hartree
chargesum: -0.0000000
charge: -0.294858 0.370993 -0.297750 0.139754 0.127438 -0.103905 -0.129457 -0.122708 -0.137422 -0.098306 0.039192 -0.076209 -0.148625 -0.095039 -0.133983 -0.082917 0.139525 0.045919 -0.077755 -0.131428 -0.093585 -0.143730 -0.095558 0.116057 -0.085153 -0.147781 -0.119104 -0.131635 -0.093823 0.082934 0.101144 0.093348 0.095939 0.116852 0.085373 0.094914 0.090192 0.090254 0.082452 0.083219 0.090035 0.088871 0.093224 0.081199 0.114404 0.098792 0.093750 0.100027 0.084930
charge: 0.326941 -1.046974 0.323955 0.629273 -0.239047 0.053553 0.067862 0.071803 0.066028 0.045504 -0.220617 0.050923 0.063992 0.065400 0.065319 0.050935 0.628677 -0.220429 0.050033 0.065592 0.066416 0.064686 0.052265 -0.236956 0.045853 0.066169 0.071847 0.067471 0.051315 -0.050582 -0.059205 -0.057864 -0.060527 -0.051802 -0.056444 -0.060234 -0.060626 -0.059432 -0.056251 -0.056189 -0.059477 -0.060419 -0.060256 -0.057429 -0.052090 -0.060376 -0.057846 -0.059052 -0.051684
qa: -0.2949 0.3710 -0.2977 0.1398 0.1274 -0.1039 -0.1295 -0.1227 -0.1374 -0.0983 0.0392 -0.0762 -0.1486 -0.0950 -0.1340 -0.0829 0.1395 0.0459 -0.0778 -0.1314 -0.0936 -0.1437 -0.0956 0.1161 -0.0852 -0.1478 -0.1191 -0.1316 -0.0938 0.0829 0.1011 0.0933 0.0959 0.1169 0.0854 0.0949 0.0902 0.0903 0.0825 0.0832 0.0900 0.0889 0.0932 0.0812 0.1144 0.0988 0.0937 0.1000 0.0849
va: 0.9535 3.6598 0.9498 2.9934 3.5318 3.7061 3.8217 3.8402 3.8008 3.6781 3.5532 3.6610 3.8175 3.8262 3.8130 3.7053 2.9848 3.5527 3.7062 3.8081 3.8278 3.8152 3.6900 3.5249 3.6555 3.7993 3.8361 3.8311 3.6898 1.0237 0.9824 0.9882 0.9850 0.9979 1.0079 0.9830 0.9852 0.9865 1.0071 1.0036 0.9865 0.9851 0.9831 1.0160 0.9987 0.9838 0.9883 0.9831 1.0224
total: -1845.856698809 hartree
dispersion: -0.056400646 hartree
energy: -1845.913099455270 hartree
dipole: -0.47976 0.40305 -0.07671 -4.73353 4.23104 -0.50248 6.89128 -6.17818 0.71310
magnitude: 0.87572 au
magnitude: 2.22591 debye
