program: Orca
programVersion: 5.0.4
elementType: P C P C C C C C C C C C C C C C C C C C C C C C C C C H H H H H H H H H H H H H H H H H H H H
charge: 2
multiplicity: 1
keywords: Opt RIJCOSX PBEh-3c
formula: C25H20P2
InChI: InChI=1/C25H20P2/c1-5-13-22(14-6-1)26(23-15-7-2-8-16-23)21-27(24-17-9-3-10-18-24)25-19-11-4-12-20-25/h1-20H
47 atoms
P  1.592573 0.025304 -0.054316
C  -0.005241 -0.04698 -0.006297
P  -1.60448 -0.067628 0.052508
C  -2.543889 1.17188 -0.745359
C  -3.803945 1.522942 -0.235948
C  -4.507957 2.548017 -0.83799
C  -3.96907 3.214506 -1.932133
C  -2.715819 2.870006 -2.431527
C  -1.994874 1.854487 -1.840097
C  -2.46293 -1.331807 0.9009
C  -3.732236 -1.726893 0.450165
C  -4.375473 -2.769685 1.088447
C  -3.767573 -3.409969 2.161924
C  -2.505969 -3.020826 2.603751
C  -1.844154 -1.987951 1.974192
C  2.507534 0.665289 1.292119
C  1.998941 0.551564 2.593191
C  2.707242 1.09698 3.643255
C  3.903118 1.767302 3.401773
C  4.398452 1.896484 2.109543
C  3.70966 1.346378 1.045943
C  2.480012 -0.539185 -1.449561
C  1.84508 -0.600324 -2.698653
C  2.539049 -1.09143 -3.783906
C  3.851905 -1.529548 -3.629791
C  4.476303 -1.48499 -2.388902
C  3.799143 -0.992269 -1.290464
H  -4.219084 1.02411 0.63011
H  -5.475377 2.833497 -0.449271
H  -4.529165 4.013406 -2.399189
H  -2.309158 3.395719 -3.28398
H  -1.020803 1.58701 -2.227953
H  -4.202022 -1.249153 -0.399795
H  -5.349007 -3.089549 0.744395
H  -4.279906 -4.223123 2.658295
H  -2.045424 -3.526382 3.440811
H  -0.862787 -1.686959 2.316002
H  1.068813 0.031513 2.780172
H  2.33385 1.001135 4.653089
H  4.452003 2.195476 4.22971
H  5.319902 2.432732 1.93121
H  4.090951 1.470297 0.040646
H  0.823735 -0.263053 -2.817901
H  2.063962 -1.134309 -4.753855
H  4.390142 -1.914567 -4.485501
H  5.489862 -1.843542 -2.276842
H  4.28391 -0.98611 -0.323018
totalener: -1643.82952949 hartree
nucrepener: 2476.83846470 hartree
electener: -4120.66799419 hartree
oneelecener: -7122.21979968 hartree
twoeener: 3001.55180549 hartree
kineticenergy: 1635.02594033 hartree
exchangeener: -101.344491660897 hartree
correlationener: -8.832527345568 hartree
xcener: -110.177019006465 hartree
dispersion: -0.038628817 hartree
dispersion: -0.038647781 hartree
dispersion: -0.038605852 hartree
dispersion: -0.038744252 hartree
dispersion: -0.038635037 hartree
dispersion: -0.038630806 hartree
dispersion: -0.038629004 hartree
chargesum: 2.0000000
charge: 0.831238 -0.421206 0.831046 -0.188245 -0.248421 -0.194020 -0.192887 -0.192188 -0.214559 -0.188944 -0.247946 -0.194202 -0.192770 -0.192571 -0.214696 -0.192593 -0.214679 -0.192932 -0.193715 -0.194150 -0.248731 -0.185962 -0.214998 -0.191240 -0.193100 -0.192874 -0.247792 0.289049 0.294543 0.300132 0.288529 0.247176 0.289039 0.294618 0.300243 0.288549 0.249538 0.249446 0.288046 0.299967 0.294031 0.288964 0.247675 0.288797 0.300550 0.294429 0.289816
charge: 0.928799 -0.555230 0.929101 -0.223336 -0.095420 -0.101261 -0.044743 -0.101242 -0.090539 -0.223539 -0.095845 -0.101262 -0.044719 -0.101097 -0.089819 -0.223305 -0.090599 -0.101218 -0.045812 -0.101280 -0.097460 -0.223555 -0.089632 -0.101045 -0.043726 -0.101437 -0.094539 0.164522 0.172207 0.174058 0.169489 0.150774 0.164470 0.172233 0.174115 0.169576 0.150437 0.150206 0.169447 0.173962 0.172037 0.164140 0.151156 0.169621 0.174200 0.172170 0.164938
qa: 0.8312 -0.4212 0.8310 -0.1882 -0.2484 -0.1940 -0.1929 -0.1922 -0.2146 -0.1889 -0.2479 -0.1942 -0.1928 -0.1926 -0.2147 -0.1926 -0.2147 -0.1929 -0.1937 -0.1942 -0.2487 -0.1860 -0.2150 -0.1912 -0.1931 -0.1929 -0.2478 0.2890 0.2945 0.3001 0.2885 0.2472 0.2890 0.2946 0.3002 0.2885 0.2495 0.2494 0.2880 0.3000 0.2940 0.2890 0.2477 0.2888 0.3006 0.2944 0.2898
va: 4.0281 3.5434 4.0280 3.6982 3.7605 3.7908 3.7518 3.7839 3.7845 3.6993 3.7606 3.7914 3.7513 3.7835 3.7840 3.7017 3.7863 3.7844 3.7517 3.7922 3.7615 3.6961 3.7833 3.7829 3.7509 3.7898 3.7597 0.8826 0.8816 0.8785 0.8844 0.9078 0.8825 0.8816 0.8785 0.8845 0.9063 0.9061 0.8848 0.8787 0.8819 0.8826 0.9076 0.8843 0.8784 0.8817 0.8817
dispersion: -0.038630497 hartree
energy: -1643.808531975494 hartree
dipole: 0.05558 -0.05831 -0.00273 0.17078 -0.15428 0.01650 0.01337 -0.02808 -0.01471
magnitude: 0.02227 au
magnitude: 0.05661 debye
