program: Orca
programVersion: 5.0.4
elementType: C F C C C C C C H H H H H H
charge: 1
multiplicity: 1
keywords: Freq RIJCOSX PBEh-3c
frequency: 0.00 0.00 0.00 0.00 0.00 0.00 128.01 221.02 275.25 404.88 450.23 451.39 623.55 652.12 664.31 814.34 870.50 877.92 1022.58 1030.72 1052.78 1059.92 1064.34 1082.27 1163.36 1238.01 1250.48 1327.21 1345.33 1411.10 1475.77 1529.50 1555.55 1654.01 1668.43 1718.80 3262.46 3279.96 3288.52 3297.86 3310.53 3313.22
frequency: 128.01 221.02 275.25 404.88 450.23 451.39 623.55 652.12 664.31 814.34 870.50 877.92 1022.58 1030.72 1052.78 1059.92 1064.34 1082.27 1163.36 1238.01 1250.48 1327.21 1345.33 1411.10 1475.77 1529.50 1555.55 1654.01 1668.43 1718.80 3262.46 3279.96 3288.52 3297.86 3310.53 3313.22
formula: C7H6F
InChI: InChI=1/C7H6F/c8-6-7-4-2-1-3-5-7/h1-6H
14 atoms
C  2.250513 0.11124 0.015379
F  2.893616 1.220044 0.052161
C  0.878096 0.067102 0.010003
C  0.263403 -1.215295 -0.038174
C  -1.104293 -1.306773 -0.052442
C  -1.866294 -0.136398 -0.017771
C  -1.277748 1.133855 0.032793
C  0.085724 1.249222 0.046828
H  2.888611 -0.768979 -0.009442
H  0.873406 -2.109921 -0.064242
H  -1.591324 -2.270441 -0.090175
H  -2.946173 -0.213194 -0.030126
H  -1.901062 2.016036 0.059793
H  0.553526 2.223701 0.085415
totalener: -369.10680371 hartree
nucrepener: 331.79241870 hartree
electener: -700.89922241 hartree
oneelecener: -1147.50767589 hartree
twoeener: 446.60845348 hartree
kineticenergy: 366.50744316 hartree
exchangeener: -26.890915209676 hartree
correlationener: -2.454083732483 hartree
xcener: -29.344998942159 hartree
energy: -690.2575 -294.1598 -290.6372 -290.5718 -290.4293 -290.4249 -289.7183 -289.7123 -44.1338 -32.1651 -29.8109 -28.6749 -26.7441 -24.5413 -24.3709 -22.5730 -22.4007 -21.4101 -20.7003 -19.6129 -19.3050 -18.8442 -18.1297 -17.3271 -16.7527 -16.4049 -14.3337 -13.6820 -8.2442 -4.8115 -3.9539 -0.8477 -0.6731 -0.4917 0.0105 0.7988 0.9460 1.8542 2.2829 3.0773 3.6271 3.7724 4.5411 6.1193 7.6505 7.7380 8.8746 9.2050 9.5805 10.1771 10.6250 11.2950 11.3691 11.5388 11.7680 11.9776 12.5973 13.0434 13.4197 13.6688 15.1505 15.4250 16.6874 19.9925 20.2588 20.6522 21.0146 21.5345 22.0727 22.7603 22.9494 23.1065 24.2409 24.6943 25.3010 26.1491 26.3699 26.5430 27.2266 28.7495 29.6309 29.8376 30.3271 31.1433 32.2502 32.5710 33.7592 35.0593 35.8428 36.5099 36.7044 37.4093 39.1231 43.6987 44.0977 46.7492 47.7252 48.4100 50.0518 50.1648 50.4310 52.2979 52.8722 52.9187 54.6762 55.0625 56.1024 56.6574 58.9896 59.3144 59.5423 62.3524 63.4967 65.6094 66.6284 68.5789 69.6070 70.3510 70.9938 73.1552 74.0449 77.9058 81.4785 88.7264 354.2372 363.8731 365.4903 372.7863 379.4412 380.8211 390.0140 888.2139 electronvolt
chargesum: 1.0000000
charge: 0.319377 -0.168887 -0.018581 -0.200819 -0.197373 -0.159641 -0.197232 -0.190583 0.291124 0.293786 0.304196 0.313538 0.304845 0.306249
charge: 0.306177 -0.018108 -0.113849 -0.019048 -0.111798 0.015322 -0.105905 -0.018717 0.177323 0.174286 0.177069 0.179728 0.177040 0.180482
qa: 0.3194 -0.1689 -0.0186 -0.2008 -0.1974 -0.1596 -0.1972 -0.1906 0.2911 0.2938 0.3042 0.3135 0.3048 0.3062
va: 3.5929 1.3002 3.6150 3.7252 3.7551 3.6983 3.7440 3.7276 0.8750 0.8819 0.8773 0.8712 0.8770 0.8806
dispersion: -0.007468338 hartree
energy: -369.092423151842 hartree
dipole: -6.55071 6.45346 -0.09725 -3.08364 2.44990 -0.63374 -0.13292 0.11144 -0.02149
magnitude: 0.64152 au
magnitude: 1.63060 debye
temp: 298.15 k
press: 1.00 atm
zeropoint: 0.11353536 hartree
thermalvibcorrection: 0.00337178 hartree
thermalrotcorrection: 0.00141627 hartree
thermaltrasncorrection: 0.00141627 hartree
thermaltotal: -368.97268348 hartree
thermalcorr: 0.00620432 hartree
nonthermalcorr: 0.11353536 hartree
totalcorr: 0.11973968 hartree
thermalcorrenthalpy: 0.00094421 hartree
totalenthalpy: -368.97173927 hartree
vibrat: 0.00535006 hartree
rotat: 0.01328291 hartree
transl: 0.01899489 hartree
total: 0.03762786 hartree
totalentropycorr: -0.03762786 hartree
gibbsenthalpy: -369.00936713 hartree
gibbsminuselec: 0.08305602 hartree
