program: Orca
programVersion: 5.0.4
elementType: C C F C C C C C C H H H H H H H H
charge: 1
multiplicity: 1
keywords: Opt RIJCOSX PBEh-3c
formula: C8H8F
InChI: InChI=1/C8H8F/c1-7(9)8-5-3-2-4-6-8/h2-6H,1H3
17 atoms
C  2.675178 0.532126 -0.025987
C  1.606891 -0.443554 0.202018
F  2.045142 -1.633575 0.467822
C  0.223691 -0.268275 0.182007
C  -0.635442 -1.364788 0.460739
C  -1.995208 -1.184254 0.443474
C  -2.523657 0.073717 0.14932
C  -1.697099 1.162825 -0.128458
C  -0.33449 1.001677 -0.113222
H  2.320645 1.520345 -0.292517
H  3.340936 0.164495 -0.811965
H  3.28661 0.607051 0.879184
H  -0.229951 -2.340309 0.689466
H  -2.655548 -2.012496 0.65678
H  -3.597652 0.207473 0.136062
H  -2.128295 2.127257 -0.355053
H  0.298248 1.850285 -0.329871
totalener: -408.36277756 hartree
nucrepener: 414.47612202 hartree
electener: -822.83889958 hartree
oneelecener: -1363.78523044 hartree
twoeener: 540.94633086 hartree
kineticenergy: 405.43099497 hartree
exchangeener: -30.180885623720 hartree
correlationener: -2.797401619627 hartree
xcener: -32.978287243348 hartree
dispersion: -0.009294160 hartree
dispersion: -0.009293566 hartree
dispersion: -0.009293267 hartree
energy: -689.8000 -294.1151 -290.2529 -290.1107 -290.0019 -289.9306 -289.4283 -289.3439 -289.3121 -43.6867 -31.7935 -29.8807 -28.3229 -28.0129 -25.5796 -24.0192 -23.6031 -22.2016 -21.2543 -21.1092 -20.3345 -19.2648 -18.8609 -18.5562 -18.0085 -17.7033 -17.5949 -16.8563 -16.3543 -15.9980 -13.8180 -13.2814 -7.7743 -4.4713 -3.6147 -1.0706 -0.3048 0.0392 0.2721 0.8609 1.0359 1.4367 1.4939 1.8281 2.4837 3.1420 3.5799 4.1665 4.4541 5.1185 7.2078 7.9614 8.0496 8.7220 9.4774 9.9334 10.1132 10.5460 11.2803 11.4757 11.6779 11.8080 12.0624 12.3207 12.3813 12.8244 13.6654 14.0044 14.0895 15.1068 15.5562 15.6686 18.7908 20.4155 20.8868 21.2337 21.7647 21.7959 22.3005 22.9188 23.2997 23.4831 23.8296 24.5101 24.8158 25.7576 26.0323 26.6874 26.7478 27.2706 27.6255 29.5075 30.3018 30.3325 30.8313 31.4240 32.9941 33.1274 33.1995 34.8332 35.1738 36.2458 36.8707 37.1665 37.8985 40.9633 42.8425 44.2371 44.4182 44.9376 47.5528 49.4248 50.0132 50.8281 51.0548 51.6238 52.8049 53.0474 53.6545 54.6750 55.1705 55.3730 57.2723 57.7672 58.0980 58.6104 59.6719 61.9066 63.8462 64.1651 66.5442 66.8516 67.4807 69.0951 70.3775 70.8719 71.9937 74.7831 75.2657 78.1131 82.9880 89.3910 355.0782 363.8982 366.0246 370.5229 375.7154 379.8983 382.3813 390.5339 889.0252 electronvolt
chargesum: 1.0000000
charge: -0.783846 0.614378 -0.197816 -0.061592 -0.196681 -0.197324 -0.171535 -0.193983 -0.221373 0.286294 0.328313 0.328641 0.296969 0.296788 0.304865 0.296469 0.271433
charge: -0.357397 0.347546 -0.036387 -0.109303 -0.026503 -0.109703 -0.002288 -0.111861 -0.035491 0.169753 0.203039 0.205057 0.176527 0.173369 0.175724 0.172784 0.165136
qa: -0.7838 0.6144 -0.1978 -0.0616 -0.1967 -0.1973 -0.1715 -0.1940 -0.2214 0.2863 0.3283 0.3286 0.2970 0.2968 0.3049 0.2965 0.2714
va: 3.6148 3.5749 1.2663 3.6388 3.7405 3.7490 3.7196 3.7648 3.7462 0.8900 0.8633 0.8622 0.8880 0.8807 0.8755 0.8806 0.8996
dispersion: -0.009293519 hartree
energy: -408.346861725381 hartree
dipole: -1.68927 1.91405 0.22478 5.36463 -4.70019 0.66444 -1.15299 1.01188 -0.14112
magnitude: 0.71549 au
magnitude: 1.81863 debye
