program: Orca
programVersion: 5.0.4
elementType: C C F F C C C C C C H H H H H H H H
charge: 0
multiplicity: 1
keywords: Opt RIJCOSX PBEh-3c
formula: C8H8F2
InChI: InChI=1/C8H8F2/c1-8(9,10)7-5-3-2-4-6-7/h2-6H,1H3
18 atoms
C  2.486107 -0.202426 0.450457
C  1.578532 0.328905 -0.63388
F  1.872413 -0.300596 -1.807801
F  1.850877 1.649772 -0.83892
C  0.113008 0.161364 -0.323626
C  -0.574189 1.153642 0.364823
C  -1.909687 0.977837 0.692592
C  -2.568389 -0.188856 0.336334
C  -1.884612 -1.180694 -0.350257
C  -0.549159 -1.007695 -0.679466
H  3.53372 -0.060664 0.184005
H  2.30583 -1.265008 0.606871
H  2.291464 0.309632 1.391553
H  -0.074991 2.071067 0.646114
H  -2.437166 1.757936 1.225223
H  -3.611026 -0.324279 0.591595
H  -2.392761 -2.09212 -0.635864
H  -0.029672 -1.787616 -1.219952
totalener: -508.32730262 hartree
nucrepener: 525.13341659 hartree
electener: -1033.46071921 hartree
oneelecener: -1737.46599614 hartree
twoeener: 704.00527693 hartree
kineticenergy: 504.83199709 hartree
exchangeener: -36.003048411315 hartree
correlationener: -3.278309195913 hartree
xcener: -39.281357607228 hartree
dispersion: -0.009971409 hartree
dispersion: -0.009971262 hartree
energy: -682.9507 -682.9475 -288.7659 -284.7720 -284.5675 -284.5629 -284.5274 -284.5138 -284.5044 -284.1749 -37.3834 -35.6610 -26.4525 -24.1664 -23.0761 -22.6889 -20.0649 -18.9158 -18.4232 -16.9736 -16.6650 -15.7359 -15.2966 -14.3042 -14.1716 -13.5621 -13.4348 -13.2586 -12.6317 -12.4359 -12.2176 -11.7335 -11.6603 -11.0923 -10.4762 -8.2488 -8.2207 0.1167 0.2970 3.7928 4.2952 4.3985 4.8277 5.3631 5.5729 5.7953 5.8647 6.5408 6.6039 7.1267 7.6284 7.8656 8.6996 8.9557 9.6845 10.4404 12.8245 13.0518 13.8684 14.2431 14.4887 15.0228 15.6339 15.7003 15.8631 16.3224 16.8213 16.9129 17.1923 17.4613 17.7721 18.4461 18.8353 19.5148 19.7586 20.5276 20.7039 20.9891 25.1959 25.4121 25.7274 25.9003 26.4429 26.8558 27.1288 27.4007 28.1174 28.5753 28.6812 28.9384 29.5885 29.6162 30.5342 31.1729 31.5582 32.5234 32.7053 33.7699 34.1673 34.7262 34.8530 35.2790 35.7163 35.8266 36.2406 36.9752 39.0605 39.1260 40.2945 40.7960 41.5379 41.8239 42.2042 42.4305 43.7579 45.9261 47.5567 48.1534 48.8681 50.3456 50.9829 51.6193 53.3945 54.6737 55.8124 55.8198 56.2159 57.2120 57.4243 58.1340 59.8467 59.8626 60.3427 60.8623 61.7037 62.1043 62.9770 63.8591 64.7196 65.2142 67.7593 69.9359 70.0390 71.5506 72.3837 74.4415 74.5319 75.7421 76.0910 76.9484 77.8932 79.7346 84.6727 85.3757 85.9148 94.6657 360.3864 370.6953 371.5275 375.8819 384.6043 384.7599 385.9202 396.3148 894.8172 899.5304 electronvolt
chargesum: -0.0000000
charge: -0.730214 0.762561 -0.333315 -0.333407 -0.060961 -0.271230 -0.203882 -0.225584 -0.204015 -0.270670 0.250310 0.238099 0.238346 0.235523 0.224516 0.224404 0.224511 0.235005
charge: -0.364148 0.276805 -0.175512 -0.175501 -0.075370 -0.121254 -0.130124 -0.128949 -0.130103 -0.121241 0.147338 0.145564 0.145584 0.145932 0.138530 0.138217 0.138525 0.145709
qa: -0.7302 0.7626 -0.3333 -0.3334 -0.0610 -0.2712 -0.2039 -0.2256 -0.2040 -0.2707 0.2503 0.2381 0.2383 0.2355 0.2245 0.2244 0.2245 0.2350
va: 3.6903 3.8564 1.0718 1.0722 3.6983 3.8192 3.8083 3.8170 3.8088 3.8184 0.9063 0.9063 0.9062 0.9150 0.9096 0.9102 0.9096 0.9149
dispersion: -0.009971356 hartree
energy: -508.302836993784 hartree
dipole: -5.05470 4.70800 -0.34671 -3.53866 3.15957 -0.37909 7.02528 -6.26708 0.75819
magnitude: 0.91585 au
magnitude: 2.32790 debye
